5.2 Build Failed on MC OSx with JAVA 1.7

classic Classic list List threaded Threaded
16 messages Options
Reply | Threaded
Open this post in threaded view
|

5.2 Build Failed on MC OSx with JAVA 1.7

zedfauji
The ' characters around the executable and arguments are
not part of the command.
09:12:33.784 [INFO] [org.gradle.api.internal.project.ant.AntLoggingAdapter] [ant:exec]
09:12:34.187 [INFO] [org.gradle.api.internal.project.ant.AntLoggingAdapter] [ant:exec] | Loading Grails 2.2.1
09:12:37.419 [INFO] [org.gradle.api.internal.project.ant.AntLoggingAdapter] [ant:exec] | Configuring classpath
09:12:45.523 [INFO] [org.gradle.api.internal.project.ant.AntLoggingAdapter] [ant:exec] | Configuring classpath.
09:12:45.523 [INFO] [org.gradle.api.internal.project.ant.AntLoggingAdapter] [ant:exec] | Environment set to test
09:12:45.523 [INFO] [org.gradle.api.internal.project.ant.AntLoggingAdapter] [ant:exec] | Environment set to test.
09:12:45.726 [INFO] [org.gradle.api.internal.project.ant.AntLoggingAdapter] [ant:exec] | Environment set to test..
09:12:45.827 [INFO] [org.gradle.api.internal.project.ant.AntLoggingAdapter] [ant:exec] | Environment set to test...
09:12:45.929 [INFO] [org.gradle.api.internal.project.ant.AntLoggingAdapter] [ant:exec] | Environment set to test....
09:12:46.740 [INFO] [org.gradle.api.internal.project.ant.AntLoggingAdapter] [ant:exec] | Environment set to test.....
09:12:48.577 [INFO] [org.gradle.api.internal.project.ant.AntLoggingAdapter] [ant:exec] | Compiling 143 source files
09:12:59.323 [INFO] [org.gradle.api.internal.project.ant.AntLoggingAdapter] [ant:exec] | Compiling 143 source files.
09:12:59.323 [INFO] [org.gradle.api.internal.project.ant.AntLoggingAdapter] [ant:exec] | Error Compilation error: startup failed:
09:12:59.323 [INFO] [org.gradle.api.internal.project.ant.AntLoggingAdapter] [ant:exec] Invalid commandline usage for javac.
09:12:59.324 [INFO] [org.gradle.api.internal.project.ant.AntLoggingAdapter] [ant:exec] javac: invalid source release: 1.7
09:12:59.324 [INFO] [org.gradle.api.internal.project.ant.AntLoggingAdapter] [ant:exec] Usage: javac <options> <source files>
09:12:59.324 [INFO] [org.gradle.api.internal.project.ant.AntLoggingAdapter] [ant:exec] use -help for a list of possible options
09:12:59.325 [INFO] [org.gradle.api.internal.project.ant.AntLoggingAdapter] [ant:exec]
09:12:59.325 [INFO] [org.gradle.api.internal.project.ant.AntLoggingAdapter] [ant:exec]
09:12:59.325 [INFO] [org.gradle.api.internal.project.ant.AntLoggingAdapter] [ant:exec] 1 error
09:12:59.733 [DEBUG] [org.gradle.logging.internal.DefaultLoggingConfigurer] Finished configuring with level: DEBUG, configurers: [org.gradle.logging.internal.OutputEventRenderer@4541139c, org.gradle.logging.internal.logback.LogbackLoggingConfigurer@336e8a49, org.gradle.logging.internal.JavaUtilLoggingConfigurer@1e38d900]
09:12:59.733 [DEBUG] [org.gradle.api.internal.tasks.execution.ExecuteAtMostOnceTaskExecuter] Finished executing task ':console:org.linkedin.glu.console-webapp:test-app'
09:12:59.734 [LIFECYCLE] [org.gradle.TaskExecutionLogger] :console:org.linkedin.glu.console-webapp:test-app FAILED
09:12:59.736 [INFO] [org.gradle.execution.taskgraph.AbstractTaskPlanExecutor] :console:org.linkedin.glu.console-webapp:test-app (Thread[main,5,main]) - complete
09:12:59.737 [DEBUG] [org.gradle.execution.taskgraph.AbstractTaskPlanExecutor] Task worker [Thread[main,5,main]] finished, busy: 43.303 secs, idle: 0.124 secs
09:12:59.746 [ERROR] [org.gradle.BuildExceptionReporter]
09:12:59.748 [ERROR] [org.gradle.BuildExceptionReporter] FAILURE: Build failed with an exception.
09:12:59.748 [ERROR] [org.gradle.BuildExceptionReporter]
09:12:59.748 [ERROR] [org.gradle.BuildExceptionReporter] * Where:
09:12:59.748 [ERROR] [org.gradle.BuildExceptionReporter] Build file '/Users/gdudhwal/Document/workspace/glu/console/org.linkedin.glu.console-webapp/build.gradle' line: 125
09:12:59.749 [ERROR] [org.gradle.BuildExceptionReporter]
09:12:59.749 [ERROR] [org.gradle.BuildExceptionReporter] * What went wrong:
09:12:59.749 [ERROR] [org.gradle.BuildExceptionReporter] Execution failed for task ':console:org.linkedin.glu.console-webapp:test-app'.
09:12:59.749 [ERROR] [org.gradle.BuildExceptionReporter] > exec returned: 1
09:12:59.758 [ERROR] [org.gradle.BuildExceptionReporter]
09:12:59.758 [ERROR] [org.gradle.BuildExceptionReporter] * Exception is:
09:12:59.760 [ERROR] [org.gradle.BuildExceptionReporter] org.gradle.api.tasks.TaskExecutionException: Execution failed for task ':console:org.linkedin.glu.console-webapp:test-app'.
09:12:59.760 [ERROR] [org.gradle.BuildExceptionReporter] at org.gradle.api.internal.tasks.execution.ExecuteActionsTaskExecuter.executeActions(ExecuteActionsTaskExecuter.java:69)
09:12:59.760 [ERROR] [org.gradle.BuildExceptionReporter] at org.gradle.api.internal.tasks.execution.ExecuteActionsTaskExecuter.execute(ExecuteActionsTaskExecuter.java:46)
09:12:59.761 [ERROR] [org.gradle.BuildExceptionReporter] at org.gradle.api.internal.tasks.execution.PostExecutionAnalysisTaskExecuter.execute(PostExecutionAnalysisTaskExecuter.java:35)
09:12:59.761 [ERROR] [org.gradle.BuildExceptionReporter] at org.gradle.api.internal.tasks.execution.SkipUpToDateTaskExecuter.execute(SkipUpToDateTaskExecuter.java:62)
09:12:59.762 [ERROR] [org.gradle.BuildExceptionReporter] at org.gradle.api.internal.tasks.execution.ValidatingTaskExecuter.execute(ValidatingTaskExecuter.java:58)
09:12:59.762 [ERROR] [org.gradle.BuildExceptionReporter] at org.gradle.api.internal.tasks.execution.SkipEmptySourceFilesTaskExecuter.execute(SkipEmptySourceFilesTaskExecuter.java:42)
09:12:59.762 [ERROR] [org.gradle.BuildExceptionReporter] at org.gradle.api.internal.tasks.execution.SkipTaskWithNoActionsExecuter.execute(SkipTaskWithNoActionsExecuter.java:52)
09:12:59.763 [ERROR] [org.gradle.BuildExceptionReporter] at org.gradle.api.internal.tasks.execution.SkipOnlyIfTaskExecuter.execute(SkipOnlyIfTaskExecuter.java:53)
09:12:59.763 [ERROR] [org.gradle.BuildExceptionReporter] at org.gradle.api.internal.tasks.execution.ExecuteAtMostOnceTaskExecuter.execute(ExecuteAtMostOnceTaskExecuter.java:43)
09:12:59.764 [ERROR] [org.gradle.BuildExceptionReporter] at org.gradle.api.internal.AbstractTask.executeWithoutThrowingTaskFailure(AbstractTask.java:286)
09:12:59.764 [ERROR] [org.gradle.BuildExceptionReporter] at org.gradle.execution.taskgraph.AbstractTaskPlanExecutor$TaskExecutorWorker.executeTask(AbstractTaskPlanExecutor.java:80)
09:12:59.764 [ERROR] [org.gradle.BuildExceptionReporter] at org.gradle.execution.taskgraph.AbstractTaskPlanExecutor$TaskExecutorWorker.processTask(AbstractTaskPlanExecutor.java:66)
09:12:59.765 [ERROR] [org.gradle.BuildExceptionReporter] at org.gradle.execution.taskgraph.AbstractTaskPlanExecutor$TaskExecutorWorker.executeTaskWithCacheLock(AbstractTaskPlanExecutor.java:58)
09:12:59.765 [ERROR] [org.gradle.BuildExceptionReporter] at org.gradle.execution.taskgraph.AbstractTaskPlanExecutor$TaskExecutorWorker.run(AbstractTaskPlanExecutor.java:47)
09:12:59.766 [ERROR] [org.gradle.BuildExceptionReporter] at org.gradle.execution.taskgraph.DefaultTaskPlanExecutor$1.run(DefaultTaskPlanExecutor.java:33)
09:12:59.767 [ERROR] [org.gradle.BuildExceptionReporter] at org.gradle.internal.Factories$1.create(Factories.java:22)
09:12:59.767 [ERROR] [org.gradle.BuildExceptionReporter] at org.gradle.cache.internal.DefaultCacheAccess.longRunningOperation(DefaultCacheAccess.java:214)
09:12:59.768 [ERROR] [org.gradle.BuildExceptionReporter] at org.gradle.cache.internal.DefaultCacheAccess.longRunningOperation(DefaultCacheAccess.java:276)
09:12:59.768 [ERROR] [org.gradle.BuildExceptionReporter] at org.gradle.cache.internal.DefaultPersistentDirectoryStore.longRunningOperation(DefaultPersistentDirectoryStore.java:142)
09:12:59.769 [ERROR] [org.gradle.BuildExceptionReporter] at org.gradle.api.internal.changedetection.state.DefaultTaskArtifactStateCacheAccess.longRunningOperation(DefaultTaskArtifactStateCacheAccess.java:78)
09:12:59.769 [ERROR] [org.gradle.BuildExceptionReporter] at org.gradle.execution.taskgraph.DefaultTaskPlanExecutor.process(DefaultTaskPlanExecutor.java:31)
09:12:59.769 [ERROR] [org.gradle.BuildExceptionReporter] at org.gradle.execution.taskgraph.DefaultTaskGraphExecuter.execute(DefaultTaskGraphExecuter.java:89)
09:12:59.770 [ERROR] [org.gradle.BuildExceptionReporter] at org.gradle.execution.SelectedTaskExecutionAction.execute(SelectedTaskExecutionAction.java:29)
09:12:59.770 [ERROR] [org.gradle.BuildExceptionReporter] at org.gradle.execution.DefaultBuildExecuter.execute(DefaultBuildExecuter.java:61)
09:12:59.770 [ERROR] [org.gradle.BuildExceptionReporter] at org.gradle.execution.DefaultBuildExecuter.access$200(DefaultBuildExecuter.java:23)
09:12:59.771 [ERROR] [org.gradle.BuildExceptionReporter] at org.gradle.execution.DefaultBuildExecuter$2.proceed(DefaultBuildExecuter.java:67)
09:12:59.771 [ERROR] [org.gradle.BuildExceptionReporter] at org.gradle.execution.DryRunBuildExecutionAction.execute(DryRunBuildExecutionAction.java:32)
09:12:59.772 [ERROR] [org.gradle.BuildExceptionReporter] at org.gradle.execution.DefaultBuildExecuter.execute(DefaultBuildExecuter.java:61)
09:12:59.772 [ERROR] [org.gradle.BuildExceptionReporter] at org.gradle.execution.DefaultBuildExecuter.execute(DefaultBuildExecuter.java:54)
09:12:59.772 [ERROR] [org.gradle.BuildExceptionReporter] at org.gradle.initialization.DefaultGradleLauncher.doBuildStages(DefaultGradleLauncher.java:166)
09:12:59.773 [ERROR] [org.gradle.BuildExceptionReporter] at org.gradle.initialization.DefaultGradleLauncher.doBuild(DefaultGradleLauncher.java:113)
09:12:59.773 [ERROR] [org.gradle.BuildExceptionReporter] at org.gradle.initialization.DefaultGradleLauncher.run(DefaultGradleLauncher.java:81)
09:12:59.773 [ERROR] [org.gradle.BuildExceptionReporter] at org.gradle.launcher.exec.InProcessBuildActionExecuter$DefaultBuildController.run(InProcessBuildActionExecuter.java:64)
09:12:59.774 [ERROR] [org.gradle.BuildExceptionReporter] at org.gradle.launcher.cli.ExecuteBuildAction.run(ExecuteBuildAction.java:33)
09:12:59.774 [ERROR] [org.gradle.BuildExceptionReporter] at org.gradle.launcher.cli.ExecuteBuildAction.run(ExecuteBuildAction.java:24)
09:12:59.775 [ERROR] [org.gradle.BuildExceptionReporter] at org.gradle.launcher.exec.InProcessBuildActionExecuter.execute(InProcessBuildActionExecuter.java:35)
09:12:59.775 [ERROR] [org.gradle.BuildExceptionReporter] at org.gradle.launcher.exec.InProcessBuildActionExecuter.execute(InProcessBuildActionExecuter.java:26)
09:12:59.776 [ERROR] [org.gradle.BuildExceptionReporter] at org.gradle.launcher.cli.RunBuildAction.run(RunBuildAction.java:50)
09:12:59.776 [ERROR] [org.gradle.BuildExceptionReporter] at org.gradle.api.internal.Actions$RunnableActionAdapter.execute(Actions.java:171)
09:12:59.776 [ERROR] [org.gradle.BuildExceptionReporter] at org.gradle.launcher.cli.CommandLineActionFactory$ParseAndBuildAction.execute(CommandLineActionFactory.java:201)
09:12:59.777 [ERROR] [org.gradle.BuildExceptionReporter] at org.gradle.launcher.cli.CommandLineActionFactory$ParseAndBuildAction.execute(CommandLineActionFactory.java:174)
09:12:59.777 [ERROR] [org.gradle.BuildExceptionReporter] at org.gradle.launcher.cli.CommandLineActionFactory$WithLogging.execute(CommandLineActionFactory.java:170)
09:12:59.778 [ERROR] [org.gradle.BuildExceptionReporter] at org.gradle.launcher.cli.CommandLineActionFactory$WithLogging.execute(CommandLineActionFactory.java:139)
09:12:59.778 [ERROR] [org.gradle.BuildExceptionReporter] at org.gradle.launcher.cli.ExceptionReportingAction.execute(ExceptionReportingAction.java:33)
09:12:59.778 [ERROR] [org.gradle.BuildExceptionReporter] at org.gradle.launcher.cli.ExceptionReportingAction.execute(ExceptionReportingAction.java:22)
09:12:59.779 [ERROR] [org.gradle.BuildExceptionReporter] at org.gradle.launcher.Main.doAction(Main.java:48)
09:12:59.779 [ERROR] [org.gradle.BuildExceptionReporter] at org.gradle.launcher.bootstrap.EntryPoint.run(EntryPoint.java:45)
09:12:59.779 [ERROR] [org.gradle.BuildExceptionReporter] at org.gradle.launcher.Main.main(Main.java:39)
09:12:59.780 [ERROR] [org.gradle.BuildExceptionReporter] at org.gradle.launcher.bootstrap.ProcessBootstrap.runNoExit(ProcessBootstrap.java:50)
09:12:59.780 [ERROR] [org.gradle.BuildExceptionReporter] at org.gradle.launcher.bootstrap.ProcessBootstrap.run(ProcessBootstrap.java:32)
09:12:59.780 [ERROR] [org.gradle.BuildExceptionReporter] at org.gradle.launcher.GradleMain.main(GradleMain.java:26)
09:12:59.781 [ERROR] [org.gradle.BuildExceptionReporter] at org.gradle.wrapper.BootstrapMainStarter.start(BootstrapMainStarter.java:33)
09:12:59.781 [ERROR] [org.gradle.BuildExceptionReporter] at org.gradle.wrapper.WrapperExecutor.execute(WrapperExecutor.java:130)
09:12:59.781 [ERROR] [org.gradle.BuildExceptionReporter] at org.gradle.wrapper.GradleWrapperMain.main(GradleWrapperMain.java:48)
09:12:59.783 [ERROR] [org.gradle.BuildExceptionReporter] Caused by: : exec returned: 1
09:12:59.783 [ERROR] [org.gradle.BuildExceptionReporter] at org.apache.tools.ant.taskdefs.ExecTask.runExecute(ExecTask.java:646)
09:12:59.783 [ERROR] [org.gradle.BuildExceptionReporter] at org.apache.tools.ant.taskdefs.ExecTask.runExec(ExecTask.java:672)
09:12:59.784 [ERROR] [org.gradle.BuildExceptionReporter] at org.apache.tools.ant.taskdefs.ExecTask.execute(ExecTask.java:498)
09:12:59.785 [ERROR] [org.gradle.BuildExceptionReporter] at org.apache.tools.ant.UnknownElement.execute(UnknownElement.java:291)
09:12:59.785 [ERROR] [org.gradle.BuildExceptionReporter] at org.apache.tools.ant.dispatch.DispatchUtils.execute(DispatchUtils.java:106)
09:12:59.785 [ERROR] [org.gradle.BuildExceptionReporter] at org.gradle.api.internal.project.ant.BasicAntBuilder.nodeCompleted(BasicAntBuilder.java:71)
09:12:59.786 [ERROR] [org.gradle.BuildExceptionReporter] at org.gradle.api.internal.project.ant.BasicAntBuilder.doInvokeMethod(BasicAntBuilder.java:86)
09:12:59.786 [ERROR] [org.gradle.BuildExceptionReporter] at org.gradle.api.internal.project.DefaultAntBuilder.super$3$invokeMethod(DefaultAntBuilder.groovy)
09:12:59.786 [ERROR] [org.gradle.BuildExceptionReporter] at org.gradle.api.internal.project.DefaultAntBuilder.invokeMethod(DefaultAntBuilder.groovy:37)
09:12:59.786 [ERROR] [org.gradle.BuildExceptionReporter] at build_70speuql1ksq48cq5kthacc86g$_run_closure5_closure20.doCall(/Users/gdudhwal/Document/workspace/glu/console/org.linkedin.glu.console-webapp/build.gradle:125)
09:12:59.787 [ERROR] [org.gradle.BuildExceptionReporter] at org.gradle.api.internal.AbstractTask$ClosureTaskAction.execute(AbstractTask.java:499)
09:12:59.787 [ERROR] [org.gradle.BuildExceptionReporter] at org.gradle.api.internal.AbstractTask$ClosureTaskAction.execute(AbstractTask.java:480)
09:12:59.787 [ERROR] [org.gradle.BuildExceptionReporter] at org.gradle.api.internal.tasks.TaskStatusNagger$1.execute(TaskStatusNagger.java:77)
09:12:59.787 [ERROR] [org.gradle.BuildExceptionReporter] at org.gradle.api.internal.tasks.TaskStatusNagger$1.execute(TaskStatusNagger.java:73)
09:12:59.787 [ERROR] [org.gradle.BuildExceptionReporter] at org.gradle.api.internal.tasks.execution.ExecuteActionsTaskExecuter.executeAction(ExecuteActionsTaskExecuter.java:80)
09:12:59.787 [ERROR] [org.gradle.BuildExceptionReporter] at org.gradle.api.internal.tasks.execution.ExecuteActionsTaskExecuter.executeActions(ExecuteActionsTaskExecuter.java:61)
09:12:59.788 [ERROR] [org.gradle.BuildExceptionReporter] ... 53 more
09:12:59.788 [ERROR] [org.gradle.BuildExceptionReporter]
09:12:59.788 [LIFECYCLE] [org.gradle.BuildResultLogger]
09:12:59.788 [LIFECYCLE] [org.gradle.BuildResultLogger] BUILD FAILED
09:12:59.788 [LIFECYCLE] [org.gradle.BuildResultLogger]
09:12:59.789 [LIFECYCLE] [org.gradle.BuildResultLogger] Total time: 1 mins 6.109 secs
-=Zed=- a.k.a -=Fauji=- More quieter you are , more you can hear
Reply | Threaded
Open this post in threaded view
|

Re: 5.2 Build Failed on MC OSx with JAVA 1.7

frenchyan
Administrator
How did you run the build? I do build on Mac OS X as well with java 1.7

Yan
Reply | Threaded
Open this post in threaded view
|

Re: 5.2 Build Failed on MC OSx with JAVA 1.7

frenchyan
Administrator
In reply to this post by zedfauji
And this is my build environment:

# java -version

java version "1.7.0_25"
Java(TM) SE Runtime Environment (build 1.7.0_25-b15)
Java HotSpot(TM) 64-Bit Server VM (build 23.25-b01, mixed mode)

Reply | Threaded
Open this post in threaded view
|

Re: 5.2 Build Failed on MC OSx with JAVA 1.7

zedfauji
This post was updated on .
In reply to this post by frenchyan
ran build as normally like in tutorial

m-********:glu *********$ ./gradlew test
Downloading http://services.gradle.org/distributions/gradle-1.7-bin.zip
.................................................................................................................................................................................................................................................................................................................................................................................................................................................................................................................................................................................................................................................................................................................................................................................................................................................................................................................................................................................................................................................................................................................................................................................................................................................................................................................................................................................................................................................................................................................................................................................................................................................................................................................................................................................................................................................................................................................................................................................................................................
Unzipping /Users/********/.gradle/wrapper/dists/gradle-1.7-bin/2g3i7gan25uopmtc0lnjb1l9ff/gradle-1.7-bin.zip to /Users/********/.gradle/wrapper/dists/gradle-1.7-bin/2g3i7gan25uopmtc0lnjb1l9ff
Set executable permissions for: /Users/gdudhwal/.gradle/wrapper/dists/gradle-1.7-bin/2g3i7gan25uopmtc0lnjb1l9ff/gradle-1.7/bin/gradle
Download http://jcenter.bintray.com/org/pongasoft/org.linkedin.gradle-plugins/2.2.4/org.linkedin.gradle-plugins-2.2.4.pom
Download http://jcenter.bintray.com/org/pongasoft/org.linkedin.gradle-plugins/2.2.4/org.linkedin.gradle-plugins-2.2.4.jar
Working in snapshot mode: 5.2.0-SNAPSHOT
:agent:org.linkedin.glu.agent-api:compileJava UP-TO-DATE
-=Zed=- a.k.a -=Fauji=- More quieter you are , more you can hear
Reply | Threaded
Open this post in threaded view
|

Re: 5.2 Build Failed on MC OSx with JAVA 1.7

zedfauji
This post was updated on .
In reply to this post by frenchyan
m-*******:glu *******$ java -version
java version "1.7.0_25"
Java(TM) SE Runtime Environment (build 1.7.0_25-b15)
Java HotSpot(TM) 64-Bit Server VM (build 23.25-b01, mixed mode)
-=Zed=- a.k.a -=Fauji=- More quieter you are , more you can hear
Reply | Threaded
Open this post in threaded view
|

Re: 5.2 Build Failed on MC OSx with JAVA 1.7

frenchyan
Administrator
I am a bit puzzled... you can check this post: http://stackoverflow.com/questions/12587089/buildr-complaining-about-javac-invalid-source-release-1-7

and try one of the proposed solution: 

export JVM_LIB=$JAVA_HOME/jre/lib/server/libjvm.dylib

Yan


On Sun, Aug 25, 2013 at 6:04 PM, zedfauji [via glu] <[hidden email]> wrote:
m-gdudhwal:glu gdudhwal$ java -version
java version "1.7.0_25"
Java(TM) SE Runtime Environment (build 1.7.0_25-b15)
Java HotSpot(TM) 64-Bit Server VM (build 23.25-b01, mixed mode)
-=Zed=- a.k.a -=Fauji=- More quieter you are , more you can hear



If you reply to this email, your message will be added to the discussion below:
http://glu.977617.n3.nabble.com/5-2-Build-Failed-on-MC-OSx-with-JAVA-1-7-tp4026015p4026019.html
To start a new topic under glu, email [hidden email]
To unsubscribe from glu, click here.
NAML

Reply | Threaded
Open this post in threaded view
|

Re: 5.2 Build Failed on MC OSx with JAVA 1.7

frenchyan
Administrator
In reply to this post by zedfauji
What about?

# javac -version
javac 1.7.0_25

Yan
Reply | Threaded
Open this post in threaded view
|

Re: 5.2 Build Failed on MC OSx with JAVA 1.7

zedfauji
m-*******:glu ******$ javac -version
javac 1.7.0_25
-=Zed=- a.k.a -=Fauji=- More quieter you are , more you can hear
Reply | Threaded
Open this post in threaded view
|

Re: 5.2 Build Failed on MC OSx with JAVA 1.7

zedfauji
In reply to this post by frenchyan
Tried this , and now got failed on below


10:50:46.240 [DEBUG] [TestEventLogger] test.setup.TestKeysGenerator > testKeysGenerator FAILED
10:50:46.241 [DEBUG] [TestEventLogger]     junit.framework.AssertionFailedError
10:50:46.242 [DEBUG] [TestEventLogger]         at junit.framework.Assert.fail(Assert.java:48)
10:50:46.242 [DEBUG] [TestEventLogger]         at junit.framework.Assert.assertTrue(Assert.java:20)
10:50:46.242 [DEBUG] [TestEventLogger]         at junit.framework.Assert.assertTrue(Assert.java:27)
10:50:46.242 [DEBUG] [TestEventLogger]         at sun.reflect.NativeMethodAccessorImpl.invoke0(Native Method)
10:50:46.243 [DEBUG] [TestEventLogger]         at sun.reflect.NativeMethodAccessorImpl.invoke(NativeMethodAccessorImpl.java:57)
10:50:46.243 [DEBUG] [TestEventLogger]         at sun.reflect.DelegatingMethodAccessorImpl.invoke(DelegatingMethodAccessorImpl.java:43)
10:50:46.243 [DEBUG] [TestEventLogger]         at java.lang.reflect.Method.invoke(Method.java:606)
10:50:46.243 [DEBUG] [TestEventLogger]         at org.codehaus.groovy.reflection.CachedMethod.invoke(CachedMethod.java:90)
10:50:46.243 [DEBUG] [TestEventLogger]         at groovy.lang.MetaMethod.doMethodInvoke(MetaMethod.java:233)
10:50:46.244 [DEBUG] [TestEventLogger]         at groovy.lang.MetaClassImpl.invokeStaticMethod(MetaClassImpl.java:1336)
10:50:46.244 [DEBUG] [TestEventLogger]         at org.codehaus.groovy.runtime.callsite.StaticMetaClassSite.callStatic(StaticMetaClassSite.java:62)
10:50:46.244 [DEBUG] [TestEventLogger]         at org.codehaus.groovy.runtime.callsite.CallSiteArray.defaultCallStatic(CallSiteArray.java:53)
10:50:46.244 [DEBUG] [TestEventLogger]         at org.codehaus.groovy.runtime.callsite.AbstractCallSite.callStatic(AbstractCallSite.java:157)
10:50:46.245 [DEBUG] [TestEventLogger]         at org.codehaus.groovy.runtime.callsite.AbstractCallSite.callStatic(AbstractCallSite.java:165)
10:50:46.245 [DEBUG] [TestEventLogger]         at test.setup.TestKeysGenerator$_testKeysGenerator_closure1.doCall(TestKeysGenerator.groovy:88)
10:50:46.245 [DEBUG] [TestEventLogger]         at sun.reflect.NativeMethodAccessorImpl.invoke0(Native Method)
10:50:46.245 [DEBUG] [TestEventLogger]         at sun.reflect.NativeMethodAccessorImpl.invoke(NativeMethodAccessorImpl.java:57)
10:50:46.246 [DEBUG] [TestEventLogger]         at sun.reflect.DelegatingMethodAccessorImpl.invoke(DelegatingMethodAccessorImpl.java:43)
10:50:46.247 [DEBUG] [TestEventLogger]         at java.lang.reflect.Method.invoke(Method.java:606)
10:50:46.248 [DEBUG] [TestEventLogger]         at org.codehaus.groovy.reflection.CachedMethod.invoke(CachedMethod.java:90)
10:50:46.248 [DEBUG] [TestEventLogger]         at groovy.lang.MetaMethod.doMethodInvoke(MetaMethod.java:233)
10:50:46.248 [DEBUG] [TestEventLogger]         at org.codehaus.groovy.runtime.metaclass.ClosureMetaClass.invokeMethod(ClosureMetaClass.java:272)
10:50:46.249 [DEBUG] [TestEventLogger]         at groovy.lang.MetaClassImpl.invokeMethod(MetaClassImpl.java:906)
10:50:46.249 [DEBUG] [TestEventLogger]         at org.codehaus.groovy.runtime.callsite.PogoMetaClassSite.call(PogoMetaClassSite.java:39)
10:50:46.250 [DEBUG] [TestEventLogger]         at org.codehaus.groovy.runtime.callsite.CallSiteArray.defaultCall(CallSiteArray.java:45)
10:50:46.250 [DEBUG] [TestEventLogger]         at org.codehaus.groovy.runtime.callsite.PogoMetaClassSite.call(PogoMetaClassSite.java:54)
10:50:46.251 [DEBUG] [TestEventLogger]         at org.codehaus.groovy.runtime.callsite.AbstractCallSite.call(AbstractCallSite.java:116)
10:50:46.252 [DEBUG] [TestEventLogger]         at org.linkedin.glu.groovy.utils.shell.ShellImpl$_createTempShell_closure4.doCall(ShellImpl.groovy:86)
10:50:46.252 [DEBUG] [TestEventLogger]         at sun.reflect.NativeMethodAccessorImpl.invoke0(Native Method)
10:50:46.252 [DEBUG] [TestEventLogger]         at sun.reflect.NativeMethodAccessorImpl.invoke(NativeMethodAccessorImpl.java:57)
10:50:46.253 [DEBUG] [TestEventLogger]         at sun.reflect.DelegatingMethodAccessorImpl.invoke(DelegatingMethodAccessorImpl.java:43)
10:50:46.253 [DEBUG] [TestEventLogger]         at java.lang.reflect.Method.invoke(Method.java:606)
10:50:46.254 [DEBUG] [TestEventLogger]         at org.codehaus.groovy.reflection.CachedMethod.invoke(CachedMethod.java:90)
10:50:46.255 [DEBUG] [TestEventLogger]         at groovy.lang.MetaMethod.doMethodInvoke(MetaMethod.java:233)
10:50:46.255 [DEBUG] [TestEventLogger]         at org.codehaus.groovy.runtime.metaclass.ClosureMetaClass.invokeMethod(ClosureMetaClass.java:272)
10:50:46.256 [DEBUG] [TestEventLogger]         at groovy.lang.MetaClassImpl.invokeMethod(MetaClassImpl.java:906)
10:50:46.256 [DEBUG] [TestEventLogger]         at org.codehaus.groovy.runtime.callsite.PogoMetaClassSite.call(PogoMetaClassSite.java:39)
10:50:46.256 [DEBUG] [TestEventLogger]         at org.codehaus.groovy.runtime.callsite.AbstractCallSite.call(AbstractCallSite.java:116)
10:50:46.256 [DEBUG] [TestEventLogger]         at org.linkedin.groovy.util.io.fs.FileSystemImpl.createTempFileSystem(FileSystemImpl.groovy:444)
10:50:46.257 [DEBUG] [TestEventLogger]         at org.linkedin.groovy.util.io.fs.FileSystemImpl$createTempFileSystem.call(Unknown Source)
10:50:46.257 [DEBUG] [TestEventLogger]         at org.linkedin.glu.groovy.utils.shell.ShellImpl.createTempShell(ShellImpl.groovy:84)
10:50:46.257 [DEBUG] [TestEventLogger]         at org.linkedin.glu.groovy.utils.shell.ShellImpl$createTempShell.call(Unknown Source)
10:50:46.258 [DEBUG] [TestEventLogger]         at org.codehaus.groovy.runtime.callsite.CallSiteArray.defaultCall(CallSiteArray.java:45)
10:50:46.258 [DEBUG] [TestEventLogger]         at org.codehaus.groovy.runtime.callsite.AbstractCallSite.call(AbstractCallSite.java:108)
10:50:46.259 [DEBUG] [TestEventLogger]         at org.codehaus.groovy.runtime.callsite.AbstractCallSite.call(AbstractCallSite.java:116)
10:50:46.266 [DEBUG] [TestEventLogger]         at test.setup.TestKeysGenerator.testKeysGenerator(TestKeysGenerator.groovy:30)
10:50:46.266 [DEBUG] [TestEventLogger]         at sun.reflect.NativeMethodAccessorImpl.invoke0(Native Method)
10:50:46.268 [DEBUG] [TestEventLogger]         at sun.reflect.NativeMethodAccessorImpl.invoke(NativeMethodAccessorImpl.java:57)
10:50:46.268 [DEBUG] [TestEventLogger]         at sun.reflect.DelegatingMethodAccessorImpl.invoke(DelegatingMethodAccessorImpl.java:43)
10:50:46.268 [DEBUG] [TestEventLogger]         at java.lang.reflect.Method.invoke(Method.java:606)
10:50:46.268 [DEBUG] [TestEventLogger]         at junit.framework.TestCase.runTest(TestCase.java:168)
10:50:46.279 [DEBUG] [TestEventLogger]         at junit.framework.TestCase.runBare(TestCase.java:134)
10:50:46.279 [DEBUG] [TestEventLogger]         at junit.framework.TestResult$1.protect(TestResult.java:110)
10:50:46.279 [DEBUG] [TestEventLogger]         at junit.framework.TestResult.runProtected(TestResult.java:128)
10:50:46.279 [DEBUG] [TestEventLogger]         at junit.framework.TestResult.run(TestResult.java:113)
10:50:46.280 [DEBUG] [TestEventLogger]         at junit.framework.TestCase.run(TestCase.java:124)
10:50:46.280 [DEBUG] [TestEventLogger]         at junit.framework.TestSuite.runTest(TestSuite.java:243)
10:50:46.280 [DEBUG] [TestEventLogger]         at junit.framework.TestSuite.run(TestSuite.java:238)
10:50:46.280 [DEBUG] [TestEventLogger]         at org.junit.internal.runners.JUnit38ClassRunner.run(JUnit38ClassRunner.java:83)
10:50:46.280 [DEBUG] [TestEventLogger]         at org.gradle.api.internal.tasks.testing.junit.JUnitTestClassExecuter.runTestClass(JUnitTestClassExecuter.java:80)
10:50:46.281 [DEBUG] [TestEventLogger]         at org.gradle.api.internal.tasks.testing.junit.JUnitTestClassExecuter.execute(JUnitTestClassExecuter.java:47)
10:50:46.281 [DEBUG] [TestEventLogger]         at org.gradle.api.internal.tasks.testing.junit.JUnitTestClassProcessor.processTestClass(JUnitTestClassProcessor.java:69)
10:50:46.281 [DEBUG] [TestEventLogger]         at org.gradle.api.internal.tasks.testing.SuiteTestClassProcessor.processTestClass(SuiteTestClassProcessor.java:49)
10:50:46.281 [DEBUG] [TestEventLogger]         at sun.reflect.NativeMethodAccessorImpl.invoke0(Native Method)
10:50:46.281 [DEBUG] [TestEventLogger]         at sun.reflect.NativeMethodAccessorImpl.invoke(NativeMethodAccessorImpl.java:57)
10:50:46.282 [DEBUG] [TestEventLogger]         at sun.reflect.DelegatingMethodAccessorImpl.invoke(DelegatingMethodAccessorImpl.java:43)
10:50:46.282 [DEBUG] [TestEventLogger]         at java.lang.reflect.Method.invoke(Method.java:606)
10:50:46.282 [DEBUG] [TestEventLogger]         at org.gradle.messaging.dispatch.ReflectionDispatch.dispatch(ReflectionDispatch.java:35)
10:50:46.282 [DEBUG] [TestEventLogger]         at org.gradle.messaging.dispatch.ReflectionDispatch.dispatch(ReflectionDispatch.java:24)
10:50:46.283 [DEBUG] [TestEventLogger]         at org.gradle.messaging.dispatch.ContextClassLoaderDispatch.dispatch(ContextClassLoaderDispatch.java:32)
10:50:46.283 [DEBUG] [TestEventLogger]         at org.gradle.messaging.dispatch.ProxyDispatchAdapter$DispatchingInvocationHandler.invoke(ProxyDispatchAdapter.java:93)
10:50:46.283 [DEBUG] [TestEventLogger]         at com.sun.proxy.$Proxy2.processTestClass(Unknown Source)
10:50:46.283 [DEBUG] [TestEventLogger]         at org.gradle.api.internal.tasks.testing.worker.TestWorker.processTestClass(TestWorker.java:103)
10:50:46.283 [DEBUG] [TestEventLogger]         at sun.reflect.NativeMethodAccessorImpl.invoke0(Native Method)
10:50:46.284 [DEBUG] [TestEventLogger]         at sun.reflect.NativeMethodAccessorImpl.invoke(NativeMethodAccessorImpl.java:57)
10:50:46.284 [DEBUG] [TestEventLogger]         at sun.reflect.DelegatingMethodAccessorImpl.invoke(DelegatingMethodAccessorImpl.java:43)
10:50:46.284 [DEBUG] [TestEventLogger]         at java.lang.reflect.Method.invoke(Method.java:606)
10:50:46.284 [DEBUG] [TestEventLogger]         at org.gradle.messaging.dispatch.ReflectionDispatch.dispatch(ReflectionDispatch.java:35)
10:50:46.284 [DEBUG] [TestEventLogger]         at org.gradle.messaging.dispatch.ReflectionDispatch.dispatch(ReflectionDispatch.java:24)
10:50:46.285 [DEBUG] [TestEventLogger]         at org.gradle.messaging.remote.internal.hub.MessageHub$Handler.run(MessageHub.java:355)
10:50:46.285 [DEBUG] [TestEventLogger]         at org.gradle.internal.concurrent.DefaultExecutorFactory$StoppableExecutorImpl$1.run(DefaultExecutorFactory.java:66)
10:50:46.285 [DEBUG] [TestEventLogger]         at java.util.concurrent.ThreadPoolExecutor.runWorker(ThreadPoolExecutor.java:1145)
10:50:46.285 [DEBUG] [TestEventLogger]         at java.util.concurrent.ThreadPoolExecutor$Worker.run(ThreadPoolExecutor.java:615)
10:50:46.286 [DEBUG] [TestEventLogger]         at java.lang.Thread.run(Thread.java:724)
10:50:46.286 [DEBUG] [TestEventLogger]
10:50:46.286 [DEBUG] [TestEventLogger] test.setup.TestKeysGenerator > testComputeChecksum STARTED
10:50:46.370 [QUIET] [system.out] 10:50:46.369 [DEBUG] [org.gradle.api.internal.tasks.testing.junit.JUnitTestClassProcessor] Executing test class test.setup.TestZooKeeperClusterPackager
10:50:46.376 [DEBUG] [TestEventLogger]
10:50:46.376 [DEBUG] [TestEventLogger] test.setup.TestKeysGenerator > testComputeChecksum PASSED
10:50:46.377 [DEBUG] [TestEventLogger]
10:50:46.377 [DEBUG] [TestEventLogger] test.setup.TestKeysGenerator FAILED
10:50:46.377 [DEBUG] [TestEventLogger]
10:50:46.378 [DEBUG] [TestEventLogger] test.setup.TestZooKeeperClusterPackager STARTED
10:50:46.544 [DEBUG] [TestEventLogger]
10:50:46.545 [DEBUG] [TestEventLogger] test.setup.TestZooKeeperClusterPackager > testTutorialModel STARTED
10:50:47.164 [DEBUG] [TestEventLogger]
10:50:47.164 [DEBUG] [TestEventLogger] test.setup.TestZooKeeperClusterPackager > testTutorialModel PASSED
10:50:47.166 [DEBUG] [TestEventLogger]
10:50:47.166 [DEBUG] [TestEventLogger] test.setup.TestZooKeeperClusterPackager > testDifferentConfigs STARTED
10:50:47.645 [DEBUG] [TestEventLogger]
10:50:47.646 [DEBUG] [TestEventLogger] test.setup.TestZooKeeperClusterPackager > testDifferentConfigs PASSED
10:50:47.646 [DEBUG] [TestEventLogger]
10:50:47.646 [DEBUG] [TestEventLogger] test.setup.TestZooKeeperClusterPackager > testCreatePackage2 STARTED
10:50:48.317 [QUIET] [system.out] 10:50:48.316 [INFO] [org.gradle.api.internal.tasks.testing.worker.TestWorker] Gradle Worker 1 finished executing tests.
10:50:48.318 [DEBUG] [TestEventLogger]
10:50:48.318 [DEBUG] [TestEventLogger] test.setup.TestZooKeeperClusterPackager > testCreatePackage2 PASSED
10:50:48.319 [DEBUG] [TestEventLogger]
10:50:48.320 [DEBUG] [TestEventLogger] test.setup.TestZooKeeperClusterPackager PASSED
10:50:48.320 [DEBUG] [TestEventLogger]
10:50:48.321 [DEBUG] [TestEventLogger] Gradle Worker 1 FAILED
10:50:48.323 [QUIET] [system.out] 10:50:48.323 [DEBUG] [org.gradle.process.internal.child.ActionExecutionWorker] Completed Gradle Worker 1.
10:50:48.329 [QUIET] [system.out] 10:50:48.329 [DEBUG] [org.gradle.process.internal.child.ActionExecutionWorker] Stopping client connection.
10:50:48.473 [DEBUG] [org.gradle.process.internal.DefaultExecHandle] Changing state to: SUCCEEDED
10:50:48.474 [INFO] [org.gradle.process.internal.DefaultExecHandle] Process 'Gradle Worker 1' finished with exit value 0 (state: SUCCEEDED)
10:50:48.477 [DEBUG] [TestEventLogger]
10:50:48.477 [DEBUG] [TestEventLogger] Test Run FAILED
10:50:48.482 [ERROR] [org.gradle.api.internal.tasks.testing.logging.TestCountLogger]
14 tests completed, 1 failed
10:50:48.508 [INFO] [org.gradle.api.internal.tasks.testing.junit.result.Binary2JUnitXmlReportGenerator] Finished generating test XML results (0.019 secs)
10:50:48.509 [INFO] [org.gradle.api.internal.tasks.testing.junit.report.DefaultTestReport] Generating HTML test report...
10:50:48.580 [INFO] [org.gradle.api.internal.tasks.testing.junit.report.DefaultTestReport] Finished generating test html results (0.071 secs)
10:50:48.583 [DEBUG] [org.gradle.logging.internal.DefaultLoggingConfigurer] Finished configuring with level: DEBUG, configurers: [org.gradle.logging.internal.OutputEventRenderer@336e8a49, org.gradle.logging.internal.logback.LogbackLoggingConfigurer@1e38d900, org.gradle.logging.internal.JavaUtilLoggingConfigurer@262e9e80]
10:50:48.583 [DEBUG] [org.gradle.api.internal.tasks.execution.ExecuteAtMostOnceTaskExecuter] Finished executing task ':packaging:org.pongasoft.glu.packaging-setup-impl:test'
10:50:48.584 [LIFECYCLE] [org.gradle.TaskExecutionLogger] :packaging:org.pongasoft.glu.packaging-setup-impl:test FAILED
10:50:48.585 [INFO] [org.gradle.execution.taskgraph.AbstractTaskPlanExecutor] :packaging:org.pongasoft.glu.packaging-setup-impl:test (Thread[main,5,main]) - complete
10:50:48.585 [DEBUG] [org.gradle.execution.taskgraph.AbstractTaskPlanExecutor] Task worker [Thread[main,5,main]] finished, busy: 56.781 secs, idle: 0.065 secs
10:50:48.594 [ERROR] [org.gradle.BuildExceptionReporter]
10:50:48.594 [ERROR] [org.gradle.BuildExceptionReporter] FAILURE: Build failed with an exception.
10:50:48.595 [ERROR] [org.gradle.BuildExceptionReporter]
10:50:48.595 [ERROR] [org.gradle.BuildExceptionReporter] * What went wrong:
10:50:48.595 [ERROR] [org.gradle.BuildExceptionReporter] Execution failed for task ':packaging:org.pongasoft.glu.packaging-setup-impl:test'.
10:50:48.596 [ERROR] [org.gradle.BuildExceptionReporter] > There were failing tests. See the report at: file:///Users/gdudhwal/Document/workspace/glu/out/build/packaging/org.pongasoft.glu.packaging-setup-impl/reports/tests/index.html
10:50:48.599 [ERROR] [org.gradle.BuildExceptionReporter]
10:50:48.599 [ERROR] [org.gradle.BuildExceptionReporter] * Exception is:
10:50:48.601 [ERROR] [org.gradle.BuildExceptionReporter] org.gradle.api.tasks.TaskExecutionException: Execution failed for task ':packaging:org.pongasoft.glu.packaging-setup-impl:test'.
-=Zed=- a.k.a -=Fauji=- More quieter you are , more you can hear
Reply | Threaded
Open this post in threaded view
|

Re: 5.2 Build Failed on MC OSx with JAVA 1.7

frenchyan
Administrator
It is most likely due to this https://github.com/pongasoft/glu/blob/master/packaging/org.pongasoft.glu.packaging-setup-impl/src/test/groovy/test/setup/TestKeysGenerator.groovy#L85

      // YP note: I have 2 versions of openssl installed... producing different outputs :(
      // /usr/bin/openssl used by IDEA (old)
      // /opt/local/bin/openssl (used by cli... most recent)
      assertTrue(consolePemContent.contains('-----BEGIN PRIVATE KEY-----'))
      assertTrue(consolePemContent.contains('-----END PRIVATE KEY-----'))
      assertTrue(consolePemContent.contains('-----BEGIN CERTIFICATE-----'))
      assertTrue(consolePemContent.contains('-----END CERTIFICATE-----'))

Feel free to comment out the assert* code.

Yan




On Sun, Aug 25, 2013 at 7:24 PM, zedfauji [via glu] <[hidden email]> wrote:
Tried this , and now got failed on below


10:50:46.240 [DEBUG] [TestEventLogger] test.setup.TestKeysGenerator > testKeysGenerator FAILED
10:50:46.241 [DEBUG] [TestEventLogger]     junit.framework.AssertionFailedError
10:50:46.242 [DEBUG] [TestEventLogger]         at junit.framework.Assert.fail(Assert.java:48)
10:50:46.242 [DEBUG] [TestEventLogger]         at junit.framework.Assert.assertTrue(Assert.java:20)
10:50:46.242 [DEBUG] [TestEventLogger]         at junit.framework.Assert.assertTrue(Assert.java:27)
10:50:46.242 [DEBUG] [TestEventLogger]         at sun.reflect.NativeMethodAccessorImpl.invoke0(Native Method)
10:50:46.243 [DEBUG] [TestEventLogger]         at sun.reflect.NativeMethodAccessorImpl.invoke(NativeMethodAccessorImpl.java:57)
10:50:46.243 [DEBUG] [TestEventLogger]         at sun.reflect.DelegatingMethodAccessorImpl.invoke(DelegatingMethodAccessorImpl.java:43)
10:50:46.243 [DEBUG] [TestEventLogger]         at java.lang.reflect.Method.invoke(Method.java:606)
10:50:46.243 [DEBUG] [TestEventLogger]         at org.codehaus.groovy.reflection.CachedMethod.invoke(CachedMethod.java:90)
10:50:46.243 [DEBUG] [TestEventLogger]         at groovy.lang.MetaMethod.doMethodInvoke(MetaMethod.java:233)
10:50:46.244 [DEBUG] [TestEventLogger]         at groovy.lang.MetaClassImpl.invokeStaticMethod(MetaClassImpl.java:1336)
10:50:46.244 [DEBUG] [TestEventLogger]         at org.codehaus.groovy.runtime.callsite.StaticMetaClassSite.callStatic(StaticMetaClassSite.java:62)
10:50:46.244 [DEBUG] [TestEventLogger]         at org.codehaus.groovy.runtime.callsite.CallSiteArray.defaultCallStatic(CallSiteArray.java:53)
10:50:46.244 [DEBUG] [TestEventLogger]         at org.codehaus.groovy.runtime.callsite.AbstractCallSite.callStatic(AbstractCallSite.java:157)
10:50:46.245 [DEBUG] [TestEventLogger]         at org.codehaus.groovy.runtime.callsite.AbstractCallSite.callStatic(AbstractCallSite.java:165)
10:50:46.245 [DEBUG] [TestEventLogger]         at test.setup.TestKeysGenerator$_testKeysGenerator_closure1.doCall(TestKeysGenerator.groovy:88)
10:50:46.245 [DEBUG] [TestEventLogger]         at sun.reflect.NativeMethodAccessorImpl.invoke0(Native Method)
10:50:46.245 [DEBUG] [TestEventLogger]         at sun.reflect.NativeMethodAccessorImpl.invoke(NativeMethodAccessorImpl.java:57)
10:50:46.246 [DEBUG] [TestEventLogger]         at sun.reflect.DelegatingMethodAccessorImpl.invoke(DelegatingMethodAccessorImpl.java:43)
10:50:46.247 [DEBUG] [TestEventLogger]         at java.lang.reflect.Method.invoke(Method.java:606)
10:50:46.248 [DEBUG] [TestEventLogger]         at org.codehaus.groovy.reflection.CachedMethod.invoke(CachedMethod.java:90)
10:50:46.248 [DEBUG] [TestEventLogger]         at groovy.lang.MetaMethod.doMethodInvoke(MetaMethod.java:233)
10:50:46.248 [DEBUG] [TestEventLogger]         at org.codehaus.groovy.runtime.metaclass.ClosureMetaClass.invokeMethod(ClosureMetaClass.java:272)
10:50:46.249 [DEBUG] [TestEventLogger]         at groovy.lang.MetaClassImpl.invokeMethod(MetaClassImpl.java:906)
10:50:46.249 [DEBUG] [TestEventLogger]         at org.codehaus.groovy.runtime.callsite.PogoMetaClassSite.call(PogoMetaClassSite.java:39)
10:50:46.250 [DEBUG] [TestEventLogger]         at org.codehaus.groovy.runtime.callsite.CallSiteArray.defaultCall(CallSiteArray.java:45)
10:50:46.250 [DEBUG] [TestEventLogger]         at org.codehaus.groovy.runtime.callsite.PogoMetaClassSite.call(PogoMetaClassSite.java:54)
10:50:46.251 [DEBUG] [TestEventLogger]         at org.codehaus.groovy.runtime.callsite.AbstractCallSite.call(AbstractCallSite.java:116)
10:50:46.252 [DEBUG] [TestEventLogger]         at org.linkedin.glu.groovy.utils.shell.ShellImpl$_createTempShell_closure4.doCall(ShellImpl.groovy:86)
10:50:46.252 [DEBUG] [TestEventLogger]         at sun.reflect.NativeMethodAccessorImpl.invoke0(Native Method)
10:50:46.252 [DEBUG] [TestEventLogger]         at sun.reflect.NativeMethodAccessorImpl.invoke(NativeMethodAccessorImpl.java:57)
10:50:46.253 [DEBUG] [TestEventLogger]         at sun.reflect.DelegatingMethodAccessorImpl.invoke(DelegatingMethodAccessorImpl.java:43)
10:50:46.253 [DEBUG] [TestEventLogger]         at java.lang.reflect.Method.invoke(Method.java:606)
10:50:46.254 [DEBUG] [TestEventLogger]         at org.codehaus.groovy.reflection.CachedMethod.invoke(CachedMethod.java:90)
10:50:46.255 [DEBUG] [TestEventLogger]         at groovy.lang.MetaMethod.doMethodInvoke(MetaMethod.java:233)
10:50:46.255 [DEBUG] [TestEventLogger]         at org.codehaus.groovy.runtime.metaclass.ClosureMetaClass.invokeMethod(ClosureMetaClass.java:272)
10:50:46.256 [DEBUG] [TestEventLogger]         at groovy.lang.MetaClassImpl.invokeMethod(MetaClassImpl.java:906)
10:50:46.256 [DEBUG] [TestEventLogger]         at org.codehaus.groovy.runtime.callsite.PogoMetaClassSite.call(PogoMetaClassSite.java:39)
10:50:46.256 [DEBUG] [TestEventLogger]         at org.codehaus.groovy.runtime.callsite.AbstractCallSite.call(AbstractCallSite.java:116)
10:50:46.256 [DEBUG] [TestEventLogger]         at org.linkedin.groovy.util.io.fs.FileSystemImpl.createTempFileSystem(FileSystemImpl.groovy:444)
10:50:46.257 [DEBUG] [TestEventLogger]         at org.linkedin.groovy.util.io.fs.FileSystemImpl$createTempFileSystem.call(Unknown Source)
10:50:46.257 [DEBUG] [TestEventLogger]         at org.linkedin.glu.groovy.utils.shell.ShellImpl.createTempShell(ShellImpl.groovy:84)
10:50:46.257 [DEBUG] [TestEventLogger]         at org.linkedin.glu.groovy.utils.shell.ShellImpl$createTempShell.call(Unknown Source)
10:50:46.258 [DEBUG] [TestEventLogger]         at org.codehaus.groovy.runtime.callsite.CallSiteArray.defaultCall(CallSiteArray.java:45)
10:50:46.258 [DEBUG] [TestEventLogger]         at org.codehaus.groovy.runtime.callsite.AbstractCallSite.call(AbstractCallSite.java:108)
10:50:46.259 [DEBUG] [TestEventLogger]         at org.codehaus.groovy.runtime.callsite.AbstractCallSite.call(AbstractCallSite.java:116)
10:50:46.266 [DEBUG] [TestEventLogger]         at test.setup.TestKeysGenerator.testKeysGenerator(TestKeysGenerator.groovy:30)
10:50:46.266 [DEBUG] [TestEventLogger]         at sun.reflect.NativeMethodAccessorImpl.invoke0(Native Method)
10:50:46.268 [DEBUG] [TestEventLogger]         at sun.reflect.NativeMethodAccessorImpl.invoke(NativeMethodAccessorImpl.java:57)
10:50:46.268 [DEBUG] [TestEventLogger]         at sun.reflect.DelegatingMethodAccessorImpl.invoke(DelegatingMethodAccessorImpl.java:43)
10:50:46.268 [DEBUG] [TestEventLogger]         at java.lang.reflect.Method.invoke(Method.java:606)
10:50:46.268 [DEBUG] [TestEventLogger]         at junit.framework.TestCase.runTest(TestCase.java:168)
10:50:46.279 [DEBUG] [TestEventLogger]         at junit.framework.TestCase.runBare(TestCase.java:134)
10:50:46.279 [DEBUG] [TestEventLogger]         at junit.framework.TestResult$1.protect(TestResult.java:110)
10:50:46.279 [DEBUG] [TestEventLogger]         at junit.framework.TestResult.runProtected(TestResult.java:128)
10:50:46.279 [DEBUG] [TestEventLogger]         at junit.framework.TestResult.run(TestResult.java:113)
10:50:46.280 [DEBUG] [TestEventLogger]         at junit.framework.TestCase.run(TestCase.java:124)
10:50:46.280 [DEBUG] [TestEventLogger]         at junit.framework.TestSuite.runTest(TestSuite.java:243)
10:50:46.280 [DEBUG] [TestEventLogger]         at junit.framework.TestSuite.run(TestSuite.java:238)
10:50:46.280 [DEBUG] [TestEventLogger]         at org.junit.internal.runners.JUnit38ClassRunner.run(JUnit38ClassRunner.java:83)
10:50:46.280 [DEBUG] [TestEventLogger]         at org.gradle.api.internal.tasks.testing.junit.JUnitTestClassExecuter.runTestClass(JUnitTestClassExecuter.java:80)
10:50:46.281 [DEBUG] [TestEventLogger]         at org.gradle.api.internal.tasks.testing.junit.JUnitTestClassExecuter.execute(JUnitTestClassExecuter.java:47)
10:50:46.281 [DEBUG] [TestEventLogger]         at org.gradle.api.internal.tasks.testing.junit.JUnitTestClassProcessor.processTestClass(JUnitTestClassProcessor.java:69)
10:50:46.281 [DEBUG] [TestEventLogger]         at org.gradle.api.internal.tasks.testing.SuiteTestClassProcessor.processTestClass(SuiteTestClassProcessor.java:49)
10:50:46.281 [DEBUG] [TestEventLogger]         at sun.reflect.NativeMethodAccessorImpl.invoke0(Native Method)
10:50:46.281 [DEBUG] [TestEventLogger]         at sun.reflect.NativeMethodAccessorImpl.invoke(NativeMethodAccessorImpl.java:57)
10:50:46.282 [DEBUG] [TestEventLogger]         at sun.reflect.DelegatingMethodAccessorImpl.invoke(DelegatingMethodAccessorImpl.java:43)
10:50:46.282 [DEBUG] [TestEventLogger]         at java.lang.reflect.Method.invoke(Method.java:606)
10:50:46.282 [DEBUG] [TestEventLogger]         at org.gradle.messaging.dispatch.ReflectionDispatch.dispatch(ReflectionDispatch.java:35)
10:50:46.282 [DEBUG] [TestEventLogger]         at org.gradle.messaging.dispatch.ReflectionDispatch.dispatch(ReflectionDispatch.java:24)
10:50:46.283 [DEBUG] [TestEventLogger]         at org.gradle.messaging.dispatch.ContextClassLoaderDispatch.dispatch(ContextClassLoaderDispatch.java:32)
10:50:46.283 [DEBUG] [TestEventLogger]         at org.gradle.messaging.dispatch.ProxyDispatchAdapter$DispatchingInvocationHandler.invoke(ProxyDispatchAdapter.java:93)
10:50:46.283 [DEBUG] [TestEventLogger]         at com.sun.proxy.$Proxy2.processTestClass(Unknown Source)
10:50:46.283 [DEBUG] [TestEventLogger]         at org.gradle.api.internal.tasks.testing.worker.TestWorker.processTestClass(TestWorker.java:103)
10:50:46.283 [DEBUG] [TestEventLogger]         at sun.reflect.NativeMethodAccessorImpl.invoke0(Native Method)
10:50:46.284 [DEBUG] [TestEventLogger]         at sun.reflect.NativeMethodAccessorImpl.invoke(NativeMethodAccessorImpl.java:57)
10:50:46.284 [DEBUG] [TestEventLogger]         at sun.reflect.DelegatingMethodAccessorImpl.invoke(DelegatingMethodAccessorImpl.java:43)
10:50:46.284 [DEBUG] [TestEventLogger]         at java.lang.reflect.Method.invoke(Method.java:606)
10:50:46.284 [DEBUG] [TestEventLogger]         at org.gradle.messaging.dispatch.ReflectionDispatch.dispatch(ReflectionDispatch.java:35)
10:50:46.284 [DEBUG] [TestEventLogger]         at org.gradle.messaging.dispatch.ReflectionDispatch.dispatch(ReflectionDispatch.java:24)
10:50:46.285 [DEBUG] [TestEventLogger]         at org.gradle.messaging.remote.internal.hub.MessageHub$Handler.run(MessageHub.java:355)
10:50:46.285 [DEBUG] [TestEventLogger]         at org.gradle.internal.concurrent.DefaultExecutorFactory$StoppableExecutorImpl$1.run(DefaultExecutorFactory.java:66)
10:50:46.285 [DEBUG] [TestEventLogger]         at java.util.concurrent.ThreadPoolExecutor.runWorker(ThreadPoolExecutor.java:1145)
10:50:46.285 [DEBUG] [TestEventLogger]         at java.util.concurrent.ThreadPoolExecutor$Worker.run(ThreadPoolExecutor.java:615)
10:50:46.286 [DEBUG] [TestEventLogger]         at java.lang.Thread.run(Thread.java:724)
10:50:46.286 [DEBUG] [TestEventLogger]
10:50:46.286 [DEBUG] [TestEventLogger] test.setup.TestKeysGenerator > testComputeChecksum STARTED
10:50:46.370 [QUIET] [system.out] 10:50:46.369 [DEBUG] [org.gradle.api.internal.tasks.testing.junit.JUnitTestClassProcessor] Executing test class test.setup.TestZooKeeperClusterPackager
10:50:46.376 [DEBUG] [TestEventLogger]
10:50:46.376 [DEBUG] [TestEventLogger] test.setup.TestKeysGenerator > testComputeChecksum PASSED
10:50:46.377 [DEBUG] [TestEventLogger]
10:50:46.377 [DEBUG] [TestEventLogger] test.setup.TestKeysGenerator FAILED
10:50:46.377 [DEBUG] [TestEventLogger]
10:50:46.378 [DEBUG] [TestEventLogger] test.setup.TestZooKeeperClusterPackager STARTED
10:50:46.544 [DEBUG] [TestEventLogger]
10:50:46.545 [DEBUG] [TestEventLogger] test.setup.TestZooKeeperClusterPackager > testTutorialModel STARTED
10:50:47.164 [DEBUG] [TestEventLogger]
10:50:47.164 [DEBUG] [TestEventLogger] test.setup.TestZooKeeperClusterPackager > testTutorialModel PASSED
10:50:47.166 [DEBUG] [TestEventLogger]
10:50:47.166 [DEBUG] [TestEventLogger] test.setup.TestZooKeeperClusterPackager > testDifferentConfigs STARTED
10:50:47.645 [DEBUG] [TestEventLogger]
10:50:47.646 [DEBUG] [TestEventLogger] test.setup.TestZooKeeperClusterPackager > testDifferentConfigs PASSED
10:50:47.646 [DEBUG] [TestEventLogger]
10:50:47.646 [DEBUG] [TestEventLogger] test.setup.TestZooKeeperClusterPackager > testCreatePackage2 STARTED
10:50:48.317 [QUIET] [system.out] 10:50:48.316 [INFO] [org.gradle.api.internal.tasks.testing.worker.TestWorker] Gradle Worker 1 finished executing tests.
10:50:48.318 [DEBUG] [TestEventLogger]
10:50:48.318 [DEBUG] [TestEventLogger] test.setup.TestZooKeeperClusterPackager > testCreatePackage2 PASSED
10:50:48.319 [DEBUG] [TestEventLogger]
10:50:48.320 [DEBUG] [TestEventLogger] test.setup.TestZooKeeperClusterPackager PASSED
10:50:48.320 [DEBUG] [TestEventLogger]
10:50:48.321 [DEBUG] [TestEventLogger] Gradle Worker 1 FAILED
10:50:48.323 [QUIET] [system.out] 10:50:48.323 [DEBUG] [org.gradle.process.internal.child.ActionExecutionWorker] Completed Gradle Worker 1.
10:50:48.329 [QUIET] [system.out] 10:50:48.329 [DEBUG] [org.gradle.process.internal.child.ActionExecutionWorker] Stopping client connection.
10:50:48.473 [DEBUG] [org.gradle.process.internal.DefaultExecHandle] Changing state to: SUCCEEDED
10:50:48.474 [INFO] [org.gradle.process.internal.DefaultExecHandle] Process 'Gradle Worker 1' finished with exit value 0 (state: SUCCEEDED)
10:50:48.477 [DEBUG] [TestEventLogger]
10:50:48.477 [DEBUG] [TestEventLogger] Test Run FAILED
10:50:48.482 [ERROR] [org.gradle.api.internal.tasks.testing.logging.TestCountLogger]
14 tests completed, 1 failed
10:50:48.508 [INFO] [org.gradle.api.internal.tasks.testing.junit.result.Binary2JUnitXmlReportGenerator] Finished generating test XML results (0.019 secs)
10:50:48.509 [INFO] [org.gradle.api.internal.tasks.testing.junit.report.DefaultTestReport] Generating HTML test report...
10:50:48.580 [INFO] [org.gradle.api.internal.tasks.testing.junit.report.DefaultTestReport] Finished generating test html results (0.071 secs)
10:50:48.583 [DEBUG] [org.gradle.logging.internal.DefaultLoggingConfigurer] Finished configuring with level: DEBUG, configurers: [org.gradle.logging.internal.OutputEventRenderer@336e8a49, org.gradle.logging.internal.logback.LogbackLoggingConfigurer@1e38d900, org.gradle.logging.internal.JavaUtilLoggingConfigurer@262e9e80]
10:50:48.583 [DEBUG] [org.gradle.api.internal.tasks.execution.ExecuteAtMostOnceTaskExecuter] Finished executing task ':packaging:org.pongasoft.glu.packaging-setup-impl:test'
10:50:48.584 [LIFECYCLE] [org.gradle.TaskExecutionLogger] :packaging:org.pongasoft.glu.packaging-setup-impl:test FAILED
10:50:48.585 [INFO] [org.gradle.execution.taskgraph.AbstractTaskPlanExecutor] :packaging:org.pongasoft.glu.packaging-setup-impl:test (Thread[main,5,main]) - complete
10:50:48.585 [DEBUG] [org.gradle.execution.taskgraph.AbstractTaskPlanExecutor] Task worker [Thread[main,5,main]] finished, busy: 56.781 secs, idle: 0.065 secs
10:50:48.594 [ERROR] [org.gradle.BuildExceptionReporter]
10:50:48.594 [ERROR] [org.gradle.BuildExceptionReporter] FAILURE: Build failed with an exception.
10:50:48.595 [ERROR] [org.gradle.BuildExceptionReporter]
10:50:48.595 [ERROR] [org.gradle.BuildExceptionReporter] * What went wrong:
10:50:48.595 [ERROR] [org.gradle.BuildExceptionReporter] Execution failed for task ':packaging:org.pongasoft.glu.packaging-setup-impl:test'.
10:50:48.596 [ERROR] [org.gradle.BuildExceptionReporter] > There were failing tests. See the report at: file:///Users/gdudhwal/Document/workspace/glu/out/build/packaging/org.pongasoft.glu.packaging-setup-impl/reports/tests/index.html
10:50:48.599 [ERROR] [org.gradle.BuildExceptionReporter]
10:50:48.599 [ERROR] [org.gradle.BuildExceptionReporter] * Exception is:
10:50:48.601 [ERROR] [org.gradle.BuildExceptionReporter] org.gradle.api.tasks.TaskExecutionException: Execution failed for task ':packaging:org.pongasoft.glu.packaging-setup-impl:test'.
-=Zed=- a.k.a -=Fauji=- More quieter you are , more you can hear



If you reply to this email, your message will be added to the discussion below:
http://glu.977617.n3.nabble.com/5-2-Build-Failed-on-MC-OSx-with-JAVA-1-7-tp4026015p4026023.html
To start a new topic under glu, email [hidden email]
To unsubscribe from glu, click here.
NAML

Reply | Threaded
Open this post in threaded view
|

Re: 5.2 Build Failed on MC OSx with JAVA 1.7

zedfauji
In reply to this post by frenchyan
Step ../../gradlew setup-2-2 is getting failed


-gdudhwal:org.linkedin.glu.agent-server gdudhwal$ ../../gradlew setup-2-2
> Loading^Cm-gdudhwal:org.linkedin.glu.agent-server gdudhwal$ ../../gradlew setup-2-2 --debug --stacktrace
13:23:49.604 [DEBUG] [org.gradle.logging.internal.DefaultLoggingConfigurer] Finished configuring with level: DEBUG, configurers: [org.gradle.logging.internal.OutputEventRenderer@336e8a49, org.gradle.logging.internal.logback.LogbackLoggingConfigurer@1e38d900, org.gradle.logging.internal.JavaUtilLoggingConfigurer@262e9e80]
13:23:50.604 [DEBUG] [org.gradle.logging.internal.DefaultLoggingConfigurer] Finished configuring with level: DEBUG, configurers: [org.gradle.logging.internal.OutputEventRenderer@336e8a49, org.gradle.logging.internal.logback.LogbackLoggingConfigurer@1e38d900, org.gradle.logging.internal.JavaUtilLoggingConfigurer@262e9e80]
13:23:50.615 [INFO] [org.gradle.BuildLogger] Starting Build
13:23:50.616 [DEBUG] [org.gradle.BuildLogger] Gradle user home: /Users/gdudhwal/.gradle







3:24:06.147 [INFO] [org.gradle.BuildLogger] All projects evaluated.
13:24:06.232 [ERROR] [org.gradle.BuildExceptionReporter]
13:24:06.233 [ERROR] [org.gradle.BuildExceptionReporter] FAILURE: Could not determine which tasks to execute.
13:24:06.234 [ERROR] [org.gradle.BuildExceptionReporter]
13:24:06.235 [ERROR] [org.gradle.BuildExceptionReporter] * What went wrong:
13:24:06.235 [ERROR] [org.gradle.BuildExceptionReporter] Task 'setup-2-2' not found in project ':agent:org.linkedin.glu.agent-server'.
13:24:06.235 [ERROR] [org.gradle.BuildExceptionReporter]
13:24:06.235 [ERROR] [org.gradle.BuildExceptionReporter] * Try:
13:24:06.236 [ERROR] [org.gradle.BuildExceptionReporter] Run gradlew tasks to get a list of available tasks.
13:24:06.238 [ERROR] [org.gradle.BuildExceptionReporter]
13:24:06.239 [ERROR] [org.gradle.BuildExceptionReporter] * Exception is:
13:24:06.240 [ERROR] [org.gradle.BuildExceptionReporter] org.gradle.execution.TaskSelectionException: Task 'setup-2-2' not found in project ':agent:org.linkedin.glu.agent-server'.
13:24:06.240 [ERROR] [org.gradle.BuildExceptionReporter] at org.gradle.execution.TaskSelector.getSelection(TaskSelector.java:67)
13:24:06.240 [ERROR] [org.gradle.BuildExceptionReporter] at org.gradle.execution.commandline.CommandLineTaskParser.parseTasks(CommandLineTaskParser.java:41)
13:24:06.241 [ERROR] [org.gradle.BuildExceptionReporter] at org.gradle.execution.TaskNameResolvingBuildConfigurationAction.doSelect(TaskNameResolvingBuildConfigurationAction.java:65)
13:24:06.241 [ERROR] [org.gradle.BuildExceptionReporter] at org.gradle.execution.TaskNameResolvingBuildConfigurationAction.configure(TaskNameResolvingBuildConfigurationAction.java:47)
13:24:06.242 [ERROR] [org.gradle.BuildExceptionReporter] at org.gradle.execution.DefaultBuildExecuter.configure(DefaultBuildExecuter.java:42)
-=Zed=- a.k.a -=Fauji=- More quieter you are , more you can hear
Reply | Threaded
Open this post in threaded view
|

Re: 5.2 Build Failed on MC OSx with JAVA 1.7

frenchyan
Administrator
This was mentioned in the release notes 


  • packaging/org.linkedin.glu.packaging-all: Creates a package which contains all prebuilt packages and is also used for the tutorial:

    ../../gradlew package // create the package
    ../../gradlew package-install // to install locally (for dev)
    
    ../../gradlew dev-setup     // generate a distribution with 1 agent in 1 fabric
                                // shell script (devsetupctl.sh) allows to start/stop
    ../../gradlew dev-setup-x-y // generate a distribution with x agents in y fabrics
                                // shell script (devsetupctl.sh) allows to start/stop
    
    ../../gradlew clean-dev-setup // to delete the setup

It is now under packaging/org.linkedin.glu.packaging-all
Note that it generates the full stack (zk, agent and console), not just the agent. 
If you don't want the console then add -Pno.console-server

I need to modify this section in the documentation which is wrong: http://pongasoft.github.io/glu/docs/latest/html/dev-setup.html#quick-setup-guide

Yan


Reply | Threaded
Open this post in threaded view
|

Re: 5.2 Build Failed on MC OSx with JAVA 1.7

zedfauji
This post was updated on .
CONTENTS DELETED
The author has deleted this message.
-=Zed=- a.k.a -=Fauji=- More quieter you are , more you can hear
Reply | Threaded
Open this post in threaded view
|

Re: 5.2 Build Failed on MC OSx with JAVA 1.7

zedfauji
In reply to this post by frenchyan
and last thing ,

admin /admin is not working anymore.

ant:exec] 2013/08/26 23:45:35.898 ERROR [ShiroLdapRealm] No LDAP server available.
[ant:exec] 2013/08/26 23:45:35.906 INFO [realm] Unable to authenticate with org.linkedin.glu.console.realms.ShiroLdapRealm - No LDAP server available.
[ant:exec] 2013/08/26 23:45:35.907 INFO [AuthController] Authentication failure for user 'admin'.
[ant:exec] 2013/08/26 23:45:38.843 ERROR [ShiroLdapRealm] Could not connect to ldap://localhost:389/: javax.naming.CommunicationException: localhost:389 [Root exception is java.net.ConnectException: Connection refused]
[ant:exec] 2013/08/26 23:45:38.844 ERROR [ShiroLdapRealm] No LDAP server available.
[ant:exec] 2013/08/26 23:45:38.844 INFO [realm] Unable to authenticate with org.linkedin.glu.console.realms.ShiroLdapRealm - No LDAP server available.
[ant:exec] 2013/08/26 23:45:38.845 INFO [AuthController] Authentication failure for user 'admin'.
-=Zed=- a.k.a -=Fauji=- More quieter you are , more you can hear
Reply | Threaded
Open this post in threaded view
|

Re: 5.2 Build Failed on MC OSx with JAVA 1.7

frenchyan
Administrator
In reply to this post by zedfauji
The instructions in the documentation for the console are correct:
  • console/org.linkedin.glu.console-webapp: The console webapp (grails application):

    ../../gradlew lib // compile all the dependencies and put them in the lib folder
    ../../gradlew run-app // after running gradle lib, you can simply run grails directly as it will use the
                          // libraries in lib to boot the app
I am not sure why you are trying to build glu yourself, but maybe you should use the binary package that is fully built for you, that way you won't run into all this issues. If you want to build glu yourself, you need to be ready to do a little bit of investigation, troubleshooting and debugging before reporting errors.

Reporting: "It's a bit messed up now and seriously i am not able to start console with new instruction" is really not useful... please investigate the issue and report on the cause. That would be much appreciated.

Thanks
Yan
Reply | Threaded
Open this post in threaded view
|

Re: 5.2 Build Failed on MC OSx with JAVA 1.7

zedfauji
My apologies Yan if i have sounded a bit sticky or geeky at the moment.
I ll keep that in mind. Thanks by the way for helping all this way.
You are awesome !!!
-=Zed=- a.k.a -=Fauji=- More quieter you are , more you can hear