Disable sslv3 for glu Agent host:port(12906)

classic Classic list List threaded Threaded
9 messages Options
Reply | Threaded
Open this post in threaded view
|  
Report Content as Inappropriate

Disable sslv3 for glu Agent host:port(12906)

sppande
Hi All,

I our company security scan detected the Glu Agent is vulnerable for sslv3 POODLE.
i also did quick test and found the vulnerability. (result explained below)
i have been looking for an option or params to disable the specific sslv3 protocol and didn't found one.

it would be great help if you can assist me on this.


SSLv3 vulnerability Test
-bash-3.2$ curl -v3 -X HEAD https://hostname:12906/ --insecure
* About to connect() to hostname port 12906
*   Trying hostIp... connected
* Connected to hostname (hostIp) port 12906
* successfully set certificate verify locations:
*   CAfile: /etc/pki/tls/certs/ca-bundle.crt
  CApath: none
* SSLv3, TLS handshake, Client hello (1):
SSLv3, TLS handshake, Server hello (2):
SSLv3, TLS handshake, CERT (11):
SSLv3, TLS handshake, Server key exchange (12):
SSLv3, TLS handshake, Request CERT (13):
SSLv3, TLS handshake, Server finished (14):
SSLv3, TLS alert, Client hello (1):
SSLv3, TLS handshake, Client key exchange (16):
SSLv3, TLS change cipher, Client hello (1):
SSLv3, TLS handshake, Finished (20):
SSLv3, TLS alert, Server hello (2):

Thanks,
Shailendra
Reply | Threaded
Open this post in threaded view
|  
Report Content as Inappropriate

Re: Disable sslv3 for glu Agent host:port(12906)

frenchyan
Administrator
I assume the section about JSSE APIs jdk 7 should have to be followed. I created a ticket to track it: https://github.com/pongasoft/glu/issues/277

I am not entirely sure what the consequences to turn it off would be though so I do not want to break all currently deployed glu installation.

Can anybody provide any feedback? Should I make it optional? Should I have the option by default to allow sslv3? Or is it so bad it should not be used at all?

Thanks
Yan
Reply | Threaded
Open this post in threaded view
|  
Report Content as Inappropriate

Re: Disable sslv3 for glu Agent host:port(12906)

frenchyan
Administrator
Reply | Threaded
Open this post in threaded view
|  
Report Content as Inappropriate

Re: Disable sslv3 for glu Agent host:port(12906)

sodul
In reply to this post by frenchyan
AFAIK SSL v3 is only useful if you want to be compatible with HTTP clients that would be over 10 year old.

Per the history on wikipedia (link below) SSLv3 came out in 1996, TLS 1.0 in 1999. I'm pretty confident that anything that talks to the Glu agents today is supporting TLS so I would recommend to simply drop support for sslv3 and not make it an option.

https://en.wikipedia.org/wiki/Transport_Layer_Security#History_and_development
Reply | Threaded
Open this post in threaded view
|  
Report Content as Inappropriate

Re: Disable sslv3 for glu Agent host:port(12906)

frenchyan
Administrator

I think I found a fix: there seems to be an easy way to disable some protocols with Restlet (which is the framework used in the agent). So I added the following entry in the code (AgentMain.groovy):

L626 =>      params.add('disabledProtocols', 'SSLv2Hello SSLv3')

Before the change:
> curl -v3 -X HEAD https://localhost:13906/ --insecure
* Hostname was NOT found in DNS cache
*   Trying ::1...
* Connected to localhost (::1) port 13906 (#0)
* successfully set certificate verify locations:
*   CAfile: /opt/local/share/curl/curl-ca-bundle.crt
  CApath: none
* SSLv3, TLS handshake, Client hello (1):
* SSLv3, TLS handshake, Server hello (2):
* SSLv3, TLS handshake, CERT (11):
* SSLv3, TLS handshake, Server key exchange (12):
* SSLv3, TLS handshake, Request CERT (13):
* SSLv3, TLS handshake, Server finished (14):
* SSLv3, TLS alert, Client hello (1):
* SSLv3, TLS handshake, Client key exchange (16):
* SSLv3, TLS change cipher, Client hello (1):
* SSLv3, TLS handshake, Finished (20):
* SSLv3, TLS alert, Server hello (2):
* error:140943F2:SSL routines:SSL3_READ_BYTES:sslv3 alert unexpected message
* Closing connection 0

After the change:
> curl -v3 -X HEAD https://localhost:13906/ --insecure
* Hostname was NOT found in DNS cache
*   Trying ::1...
* Connected to localhost (::1) port 13906 (#0)
* successfully set certificate verify locations:
*   CAfile: /opt/local/share/curl/curl-ca-bundle.crt
  CApath: none
* SSLv3, TLS handshake, Client hello (1):
* SSLv3, TLS alert, Server hello (2):
* error:1408F10B:SSL routines:SSL3_GET_RECORD:wrong version number
* Closing connection 0
curl: (35) error:1408F10B:SSL routines:SSL3_GET_RECORD:wrong version number

Can you please confirm that this change fixes the issue? Is there any other test I can run to be sure?

If it is fixing the issue then I will release a new version of glu

Thanks
Yan
Reply | Threaded
Open this post in threaded view
|  
Report Content as Inappropriate

Re: Disable sslv3 for glu Agent host:port(12906)

sppande
Thanks a lot Yan for quick one,  

Other option to test and verfiy would be using openssl,
reference - http://chrisburgess.com.au/how-to-test-for-the-sslv3-poodle-vulnerability/
                 https://disablessl3.com/
command:
openssl s_client -connect localhost:13906 -ssl3

Seems like the fix is working, since you are getting the expected error message when the protocol is not suppoerted. Please refer - https://groups.google.com/forum/#!msg/git-users/5cQ4I7qRx0I/GreM5nA_uNIJ
                 
Thanks,
Shailendra
Reply | Threaded
Open this post in threaded view
|  
Report Content as Inappropriate

Re: Disable sslv3 for glu Agent host:port(12906)

sppande
Hi Yan,

Unfortunately i never build the glu locally before, Today i tried multiple time but all my attempts ended up in build failures (not sure, if i am missing anything) .

i must say the fix you mentioned is going to fix the sslv3 POODLE. Also you test results looks pretty positive.

see if we can push the changes. or else you can make a build and i can test it.

Thanks,
Shailendra


Trying Building 5.5.2

$ ../../gradlew --version

------------------------------------------------------------
Gradle 1.11
------------------------------------------------------------

Build time:   2014-02-11 11:34:39 UTC
Build number: none
Revision:     xxx

Groovy:       1.8.6
Ant:          Apache Ant(TM) version 1.9.2 compiled on July 8 2013
Ivy:          2.2.0
JVM:          1.7.0_67 (Oracle Corporation 24.65-b04)
OS:           Mac OS X 10.10 x86_64


StackTrace-

16:22:11.213 [DEBUG] [org.gradle.configuration.project.BuildScriptProcessor] Timing: Running the build script took 3.58 secs
16:22:11.224 [ERROR] [org.gradle.BuildExceptionReporter]
16:22:11.234 [ERROR] [org.gradle.BuildExceptionReporter] FAILURE: Build failed with an exception.
16:22:11.235 [ERROR] [org.gradle.BuildExceptionReporter]
16:22:11.235 [ERROR] [org.gradle.BuildExceptionReporter] * Where:
16:22:11.235 [ERROR] [org.gradle.BuildExceptionReporter] Build file '/Users/s_pande/Developer/TEAMOPS/glu-compile/build.gradle' line: 55
16:22:11.235 [ERROR] [org.gradle.BuildExceptionReporter]
16:22:11.237 [ERROR] [org.gradle.BuildExceptionReporter] * What went wrong:
16:22:11.237 [ERROR] [org.gradle.BuildExceptionReporter] A problem occurred evaluating root project 'glu-compile'.
16:22:11.237 [ERROR] [org.gradle.BuildExceptionReporter] > [Ljava/util/HashMap$Entry;
16:22:11.239 [ERROR] [org.gradle.BuildExceptionReporter]
16:22:11.240 [ERROR] [org.gradle.BuildExceptionReporter] * Exception is:
16:22:11.255 [ERROR] [org.gradle.BuildExceptionReporter] org.gradle.api.GradleScriptException: A problem occurred evaluating root project 'glu-compile'.
16:22:11.256 [ERROR] [org.gradle.BuildExceptionReporter] at org.gradle.groovy.scripts.internal.DefaultScriptRunnerFactory$ScriptRunnerImpl.run(DefaultScriptRunnerFactory.java:54)
16:22:11.256 [ERROR] [org.gradle.BuildExceptionReporter] at org.gradle.configuration.DefaultScriptPluginFactory$ScriptPluginImpl.apply(DefaultScriptPluginFactory.java:177)
16:22:11.256 [ERROR] [org.gradle.BuildExceptionReporter] at org.gradle.configuration.project.BuildScriptProcessor.execute(BuildScriptProcessor.java:38)
16:22:11.258 [ERROR] [org.gradle.BuildExceptionReporter] at org.gradle.configuration.project.BuildScriptProcessor.execute(BuildScriptProcessor.java:25)
16:22:11.259 [ERROR] [org.gradle.BuildExceptionReporter] at org.gradle.configuration.project.ConfigureActionsProjectEvaluator.evaluate(ConfigureActionsProjectEvaluator.java:34)
16:22:11.259 [ERROR] [org.gradle.BuildExceptionReporter] at org.gradle.configuration.project.LifecycleProjectEvaluator.evaluate(LifecycleProjectEvaluator.java:55)
16:22:11.259 [ERROR] [org.gradle.BuildExceptionReporter] at org.gradle.api.internal.project.AbstractProject.evaluate(AbstractProject.java:507)
16:22:11.259 [ERROR] [org.gradle.BuildExceptionReporter] at org.gradle.api.internal.project.AbstractProject.evaluate(AbstractProject.java:82)
16:22:11.259 [ERROR] [org.gradle.BuildExceptionReporter] at org.gradle.configuration.DefaultBuildConfigurer.configure(DefaultBuildConfigurer.java:31)
16:22:11.259 [ERROR] [org.gradle.BuildExceptionReporter] at org.gradle.initialization.DefaultGradleLauncher.doBuildStages(DefaultGradleLauncher.java:142)
16:22:11.259 [ERROR] [org.gradle.BuildExceptionReporter] at org.gradle.initialization.DefaultGradleLauncher.doBuild(DefaultGradleLauncher.java:113)
16:22:11.260 [ERROR] [org.gradle.BuildExceptionReporter] at org.gradle.initialization.DefaultGradleLauncher.run(DefaultGradleLauncher.java:81)
16:22:11.260 [ERROR] [org.gradle.BuildExceptionReporter] at org.gradle.launcher.exec.InProcessBuildActionExecuter$DefaultBuildController.run(InProcessBuildActionExecuter.java:64)
16:22:11.260 [ERROR] [org.gradle.BuildExceptionReporter] at org.gradle.launcher.cli.ExecuteBuildAction.run(ExecuteBuildAction.java:33)
16:22:11.260 [ERROR] [org.gradle.BuildExceptionReporter] at org.gradle.launcher.cli.ExecuteBuildAction.run(ExecuteBuildAction.java:24)
16:22:11.260 [ERROR] [org.gradle.BuildExceptionReporter] at org.gradle.launcher.exec.InProcessBuildActionExecuter.execute(InProcessBuildActionExecuter.java:35)
16:22:11.260 [ERROR] [org.gradle.BuildExceptionReporter] at org.gradle.launcher.exec.InProcessBuildActionExecuter.execute(InProcessBuildActionExecuter.java:26)
16:22:11.261 [ERROR] [org.gradle.BuildExceptionReporter] at org.gradle.launcher.cli.RunBuildAction.run(RunBuildAction.java:50)
16:22:11.261 [ERROR] [org.gradle.BuildExceptionReporter] at org.gradle.internal.Actions$RunnableActionAdapter.execute(Actions.java:171)
16:22:11.261 [ERROR] [org.gradle.BuildExceptionReporter] at org.gradle.launcher.cli.CommandLineActionFactory$ParseAndBuildAction.execute(CommandLineActionFactory.java:201)
16:22:11.261 [ERROR] [org.gradle.BuildExceptionReporter] at org.gradle.launcher.cli.CommandLineActionFactory$ParseAndBuildAction.execute(CommandLineActionFactory.java:174)
16:22:11.261 [ERROR] [org.gradle.BuildExceptionReporter] at org.gradle.launcher.cli.CommandLineActionFactory$WithLogging.execute(CommandLineActionFactory.java:170)
16:22:11.262 [ERROR] [org.gradle.BuildExceptionReporter] at org.gradle.launcher.cli.CommandLineActionFactory$WithLogging.execute(CommandLineActionFactory.java:139)
16:22:11.262 [ERROR] [org.gradle.BuildExceptionReporter] at org.gradle.launcher.cli.ExceptionReportingAction.execute(ExceptionReportingAction.java:33)
16:22:11.262 [ERROR] [org.gradle.BuildExceptionReporter] at org.gradle.launcher.cli.ExceptionReportingAction.execute(ExceptionReportingAction.java:22)
16:22:11.262 [ERROR] [org.gradle.BuildExceptionReporter] at org.gradle.launcher.Main.doAction(Main.java:46)
16:22:11.262 [ERROR] [org.gradle.BuildExceptionReporter] at org.gradle.launcher.bootstrap.EntryPoint.run(EntryPoint.java:45)
16:22:11.263 [ERROR] [org.gradle.BuildExceptionReporter] at org.gradle.launcher.Main.main(Main.java:37)
16:22:11.263 [ERROR] [org.gradle.BuildExceptionReporter] at org.gradle.launcher.bootstrap.ProcessBootstrap.runNoExit(ProcessBootstrap.java:50)
16:22:11.263 [ERROR] [org.gradle.BuildExceptionReporter] at org.gradle.launcher.bootstrap.ProcessBootstrap.run(ProcessBootstrap.java:32)
16:22:11.263 [ERROR] [org.gradle.BuildExceptionReporter] at org.gradle.launcher.GradleMain.main(GradleMain.java:23)
16:22:11.263 [ERROR] [org.gradle.BuildExceptionReporter] at org.gradle.wrapper.BootstrapMainStarter.start(BootstrapMainStarter.java:30)
16:22:11.264 [ERROR] [org.gradle.BuildExceptionReporter] at org.gradle.wrapper.WrapperExecutor.execute(WrapperExecutor.java:127)
16:22:11.264 [ERROR] [org.gradle.BuildExceptionReporter] at org.gradle.wrapper.GradleWrapperMain.main(GradleWrapperMain.java:58)
16:22:11.264 [ERROR] [org.gradle.BuildExceptionReporter] Caused by: java.lang.NoClassDefFoundError: [Ljava/util/HashMap$Entry;
16:22:11.264 [ERROR] [org.gradle.BuildExceptionReporter] at org.linkedin.gradle.plugins.UserConfigPlugin.apply(UserConfigPlugin.groovy:40)
16:22:11.264 [ERROR] [org.gradle.BuildExceptionReporter] at org.linkedin.gradle.plugins.UserConfigPlugin.apply(UserConfigPlugin.groovy)
16:22:11.265 [ERROR] [org.gradle.BuildExceptionReporter] at org.gradle.api.internal.plugins.DefaultPluginContainer.providePlugin(DefaultPluginContainer.java:104)
16:22:11.265 [ERROR] [org.gradle.BuildExceptionReporter] at org.gradle.api.internal.plugins.DefaultPluginContainer.addPluginInternal(DefaultPluginContainer.java:68)
16:22:11.265 [ERROR] [org.gradle.BuildExceptionReporter] at org.gradle.api.internal.plugins.DefaultPluginContainer.apply(DefaultPluginContainer.java:34)
16:22:11.265 [ERROR] [org.gradle.BuildExceptionReporter] at org.gradle.api.internal.plugins.DefaultObjectConfigurationAction.applyPlugin(DefaultObjectConfigurationAction.java:101)
16:22:11.265 [ERROR] [org.gradle.BuildExceptionReporter] at org.gradle.api.internal.plugins.DefaultObjectConfigurationAction.access$200(DefaultObjectConfigurationAction.java:32)
16:22:11.266 [ERROR] [org.gradle.BuildExceptionReporter] at org.gradle.api.internal.plugins.DefaultObjectConfigurationAction$3.run(DefaultObjectConfigurationAction.java:72)
16:22:11.266 [ERROR] [org.gradle.BuildExceptionReporter] at org.gradle.api.internal.plugins.DefaultObjectConfigurationAction.execute(DefaultObjectConfigurationAction.java:114)
16:22:11.266 [ERROR] [org.gradle.BuildExceptionReporter] at org.gradle.api.internal.project.AbstractPluginAware.apply(AbstractPluginAware.java:39)
16:22:11.266 [ERROR] [org.gradle.BuildExceptionReporter] at org.gradle.api.Project$apply.call(Unknown Source)
16:22:11.266 [ERROR] [org.gradle.BuildExceptionReporter] at org.gradle.api.internal.project.ProjectScript.apply(ProjectScript.groovy:34)
16:22:11.266 [ERROR] [org.gradle.BuildExceptionReporter] at org.gradle.api.Script$apply.callCurrent(Unknown Source)
16:22:11.267 [ERROR] [org.gradle.BuildExceptionReporter] at build_1a031k947781okvoqckl64hqjj.run(/Users/s_pande/Developer/TEAMOPS/glu-compile/build.gradle:55)
16:22:11.267 [ERROR] [org.gradle.BuildExceptionReporter] at org.gradle.groovy.scripts.internal.DefaultScriptRunnerFactory$ScriptRunnerImpl.run(DefaultScriptRunnerFactory.java:52)
16:22:11.267 [ERROR] [org.gradle.BuildExceptionReporter] ... 33 more
16:22:11.267 [ERROR] [org.gradle.BuildExceptionReporter] Caused by: java.lang.ClassNotFoundException: java.util.HashMap$Entry
16:22:11.267 [ERROR] [org.gradle.BuildExceptionReporter] ... 48 more


Reply | Threaded
Open this post in threaded view
|  
Report Content as Inappropriate

Re: Disable sslv3 for glu Agent host:port(12906)

frenchyan
Administrator

I was planning to release it today but ran out of time. Will push tomorrow most likely.

Yan

On Jan 19, 2015 2:36 PM, "sppande [via glu]" <[hidden email]> wrote:
Hi Yan,

Unfortunately i never build the glu locally before, Today i tried multiple time but all my attempts ended up in build failures (not sure, if i am missing anything) .

i must say the fix you mentioned is going to fix the sslv3 POODLE. Also you test results looks pretty positive.

see if we can push the changes. or else you can make a build and i can test it.

Thanks,
Shailendra


Trying Building 5.5.2

$ ../../gradlew --version

------------------------------------------------------------
Gradle 1.11
------------------------------------------------------------

Build time:   2014-02-11 11:34:39 UTC
Build number: none
Revision:     xxx

Groovy:       1.8.6
Ant:          Apache Ant(TM) version 1.9.2 compiled on July 8 2013
Ivy:          2.2.0
JVM:          1.7.0_67 (Oracle Corporation 24.65-b04)
OS:           Mac OS X 10.10 x86_64


StackTrace-

16:22:11.213 [DEBUG] [org.gradle.configuration.project.BuildScriptProcessor] Timing: Running the build script took 3.58 secs
16:22:11.224 [ERROR] [org.gradle.BuildExceptionReporter]
16:22:11.234 [ERROR] [org.gradle.BuildExceptionReporter] FAILURE: Build failed with an exception.
16:22:11.235 [ERROR] [org.gradle.BuildExceptionReporter]
16:22:11.235 [ERROR] [org.gradle.BuildExceptionReporter] * Where:
16:22:11.235 [ERROR] [org.gradle.BuildExceptionReporter] Build file '/Users/s_pande/Developer/TEAMOPS/glu-compile/build.gradle' line: 55
16:22:11.235 [ERROR] [org.gradle.BuildExceptionReporter]
16:22:11.237 [ERROR] [org.gradle.BuildExceptionReporter] * What went wrong:
16:22:11.237 [ERROR] [org.gradle.BuildExceptionReporter] A problem occurred evaluating root project 'glu-compile'.
16:22:11.237 [ERROR] [org.gradle.BuildExceptionReporter] > [Ljava/util/HashMap$Entry;
16:22:11.239 [ERROR] [org.gradle.BuildExceptionReporter]
16:22:11.240 [ERROR] [org.gradle.BuildExceptionReporter] * Exception is:
16:22:11.255 [ERROR] [org.gradle.BuildExceptionReporter] org.gradle.api.GradleScriptException: A problem occurred evaluating root project 'glu-compile'.
16:22:11.256 [ERROR] [org.gradle.BuildExceptionReporter] at org.gradle.groovy.scripts.internal.DefaultScriptRunnerFactory$ScriptRunnerImpl.run(DefaultScriptRunnerFactory.java:54)
16:22:11.256 [ERROR] [org.gradle.BuildExceptionReporter] at org.gradle.configuration.DefaultScriptPluginFactory$ScriptPluginImpl.apply(DefaultScriptPluginFactory.java:177)
16:22:11.256 [ERROR] [org.gradle.BuildExceptionReporter] at org.gradle.configuration.project.BuildScriptProcessor.execute(BuildScriptProcessor.java:38)
16:22:11.258 [ERROR] [org.gradle.BuildExceptionReporter] at org.gradle.configuration.project.BuildScriptProcessor.execute(BuildScriptProcessor.java:25)
16:22:11.259 [ERROR] [org.gradle.BuildExceptionReporter] at org.gradle.configuration.project.ConfigureActionsProjectEvaluator.evaluate(ConfigureActionsProjectEvaluator.java:34)
16:22:11.259 [ERROR] [org.gradle.BuildExceptionReporter] at org.gradle.configuration.project.LifecycleProjectEvaluator.evaluate(LifecycleProjectEvaluator.java:55)
16:22:11.259 [ERROR] [org.gradle.BuildExceptionReporter] at org.gradle.api.internal.project.AbstractProject.evaluate(AbstractProject.java:507)
16:22:11.259 [ERROR] [org.gradle.BuildExceptionReporter] at org.gradle.api.internal.project.AbstractProject.evaluate(AbstractProject.java:82)
16:22:11.259 [ERROR] [org.gradle.BuildExceptionReporter] at org.gradle.configuration.DefaultBuildConfigurer.configure(DefaultBuildConfigurer.java:31)
16:22:11.259 [ERROR] [org.gradle.BuildExceptionReporter] at org.gradle.initialization.DefaultGradleLauncher.doBuildStages(DefaultGradleLauncher.java:142)
16:22:11.259 [ERROR] [org.gradle.BuildExceptionReporter] at org.gradle.initialization.DefaultGradleLauncher.doBuild(DefaultGradleLauncher.java:113)
16:22:11.260 [ERROR] [org.gradle.BuildExceptionReporter] at org.gradle.initialization.DefaultGradleLauncher.run(DefaultGradleLauncher.java:81)
16:22:11.260 [ERROR] [org.gradle.BuildExceptionReporter] at org.gradle.launcher.exec.InProcessBuildActionExecuter$DefaultBuildController.run(InProcessBuildActionExecuter.java:64)
16:22:11.260 [ERROR] [org.gradle.BuildExceptionReporter] at org.gradle.launcher.cli.ExecuteBuildAction.run(ExecuteBuildAction.java:33)
16:22:11.260 [ERROR] [org.gradle.BuildExceptionReporter] at org.gradle.launcher.cli.ExecuteBuildAction.run(ExecuteBuildAction.java:24)
16:22:11.260 [ERROR] [org.gradle.BuildExceptionReporter] at org.gradle.launcher.exec.InProcessBuildActionExecuter.execute(InProcessBuildActionExecuter.java:35)
16:22:11.260 [ERROR] [org.gradle.BuildExceptionReporter] at org.gradle.launcher.exec.InProcessBuildActionExecuter.execute(InProcessBuildActionExecuter.java:26)
16:22:11.261 [ERROR] [org.gradle.BuildExceptionReporter] at org.gradle.launcher.cli.RunBuildAction.run(RunBuildAction.java:50)
16:22:11.261 [ERROR] [org.gradle.BuildExceptionReporter] at org.gradle.internal.Actions$RunnableActionAdapter.execute(Actions.java:171)
16:22:11.261 [ERROR] [org.gradle.BuildExceptionReporter] at org.gradle.launcher.cli.CommandLineActionFactory$ParseAndBuildAction.execute(CommandLineActionFactory.java:201)
16:22:11.261 [ERROR] [org.gradle.BuildExceptionReporter] at org.gradle.launcher.cli.CommandLineActionFactory$ParseAndBuildAction.execute(CommandLineActionFactory.java:174)
16:22:11.261 [ERROR] [org.gradle.BuildExceptionReporter] at org.gradle.launcher.cli.CommandLineActionFactory$WithLogging.execute(CommandLineActionFactory.java:170)
16:22:11.262 [ERROR] [org.gradle.BuildExceptionReporter] at org.gradle.launcher.cli.CommandLineActionFactory$WithLogging.execute(CommandLineActionFactory.java:139)
16:22:11.262 [ERROR] [org.gradle.BuildExceptionReporter] at org.gradle.launcher.cli.ExceptionReportingAction.execute(ExceptionReportingAction.java:33)
16:22:11.262 [ERROR] [org.gradle.BuildExceptionReporter] at org.gradle.launcher.cli.ExceptionReportingAction.execute(ExceptionReportingAction.java:22)
16:22:11.262 [ERROR] [org.gradle.BuildExceptionReporter] at org.gradle.launcher.Main.doAction(Main.java:46)
16:22:11.262 [ERROR] [org.gradle.BuildExceptionReporter] at org.gradle.launcher.bootstrap.EntryPoint.run(EntryPoint.java:45)
16:22:11.263 [ERROR] [org.gradle.BuildExceptionReporter] at org.gradle.launcher.Main.main(Main.java:37)
16:22:11.263 [ERROR] [org.gradle.BuildExceptionReporter] at org.gradle.launcher.bootstrap.ProcessBootstrap.runNoExit(ProcessBootstrap.java:50)
16:22:11.263 [ERROR] [org.gradle.BuildExceptionReporter] at org.gradle.launcher.bootstrap.ProcessBootstrap.run(ProcessBootstrap.java:32)
16:22:11.263 [ERROR] [org.gradle.BuildExceptionReporter] at org.gradle.launcher.GradleMain.main(GradleMain.java:23)
16:22:11.263 [ERROR] [org.gradle.BuildExceptionReporter] at org.gradle.wrapper.BootstrapMainStarter.start(BootstrapMainStarter.java:30)
16:22:11.264 [ERROR] [org.gradle.BuildExceptionReporter] at org.gradle.wrapper.WrapperExecutor.execute(WrapperExecutor.java:127)
16:22:11.264 [ERROR] [org.gradle.BuildExceptionReporter] at org.gradle.wrapper.GradleWrapperMain.main(GradleWrapperMain.java:58)
16:22:11.264 [ERROR] [org.gradle.BuildExceptionReporter] Caused by: java.lang.NoClassDefFoundError: [Ljava/util/HashMap$Entry;
16:22:11.264 [ERROR] [org.gradle.BuildExceptionReporter] at org.linkedin.gradle.plugins.UserConfigPlugin.apply(UserConfigPlugin.groovy:40)
16:22:11.264 [ERROR] [org.gradle.BuildExceptionReporter] at org.linkedin.gradle.plugins.UserConfigPlugin.apply(UserConfigPlugin.groovy)
16:22:11.265 [ERROR] [org.gradle.BuildExceptionReporter] at org.gradle.api.internal.plugins.DefaultPluginContainer.providePlugin(DefaultPluginContainer.java:104)
16:22:11.265 [ERROR] [org.gradle.BuildExceptionReporter] at org.gradle.api.internal.plugins.DefaultPluginContainer.addPluginInternal(DefaultPluginContainer.java:68)
16:22:11.265 [ERROR] [org.gradle.BuildExceptionReporter] at org.gradle.api.internal.plugins.DefaultPluginContainer.apply(DefaultPluginContainer.java:34)
16:22:11.265 [ERROR] [org.gradle.BuildExceptionReporter] at org.gradle.api.internal.plugins.DefaultObjectConfigurationAction.applyPlugin(DefaultObjectConfigurationAction.java:101)
16:22:11.265 [ERROR] [org.gradle.BuildExceptionReporter] at org.gradle.api.internal.plugins.DefaultObjectConfigurationAction.access$200(DefaultObjectConfigurationAction.java:32)
16:22:11.266 [ERROR] [org.gradle.BuildExceptionReporter] at org.gradle.api.internal.plugins.DefaultObjectConfigurationAction$3.run(DefaultObjectConfigurationAction.java:72)
16:22:11.266 [ERROR] [org.gradle.BuildExceptionReporter] at org.gradle.api.internal.plugins.DefaultObjectConfigurationAction.execute(DefaultObjectConfigurationAction.java:114)
16:22:11.266 [ERROR] [org.gradle.BuildExceptionReporter] at org.gradle.api.internal.project.AbstractPluginAware.apply(AbstractPluginAware.java:39)
16:22:11.266 [ERROR] [org.gradle.BuildExceptionReporter] at org.gradle.api.Project$apply.call(Unknown Source)
16:22:11.266 [ERROR] [org.gradle.BuildExceptionReporter] at org.gradle.api.internal.project.ProjectScript.apply(ProjectScript.groovy:34)
16:22:11.266 [ERROR] [org.gradle.BuildExceptionReporter] at org.gradle.api.Script$apply.callCurrent(Unknown Source)
16:22:11.267 [ERROR] [org.gradle.BuildExceptionReporter] at build_1a031k947781okvoqckl64hqjj.run(/Users/s_pande/Developer/TEAMOPS/glu-compile/build.gradle:55)
16:22:11.267 [ERROR] [org.gradle.BuildExceptionReporter] at org.gradle.groovy.scripts.internal.DefaultScriptRunnerFactory$ScriptRunnerImpl.run(DefaultScriptRunnerFactory.java:52)
16:22:11.267 [ERROR] [org.gradle.BuildExceptionReporter] ... 33 more
16:22:11.267 [ERROR] [org.gradle.BuildExceptionReporter] Caused by: java.lang.ClassNotFoundException: java.util.HashMap$Entry
16:22:11.267 [ERROR] [org.gradle.BuildExceptionReporter] ... 48 more





If you reply to this email, your message will be added to the discussion below:
http://glu.977617.n3.nabble.com/Disable-sslv3-for-glu-Agent-host-port-12906-tp4026813p4026819.html
To start a new topic under glu, email [hidden email]
To unsubscribe from glu, click here.
NAML
Reply | Threaded
Open this post in threaded view
|  
Report Content as Inappropriate

Re: Disable sslv3 for glu Agent host:port(12906)

sppande
Thanks a lot Yan. Highly Appreciated.
Loading...