Unable to compile glu - testAgentZooKeeper FAILED

classic Classic list List threaded Threaded
2 messages Options
Reply | Threaded
Open this post in threaded view
|  
Report Content as Inappropriate

Unable to compile glu - testAgentZooKeeper FAILED

Paritosh
Hi,

Not able to compile glu on my local machine. Below step is getting fail

./gradlew test  --debug  --stacktrace

below is the stacktrace.

12:44:22.202 [DEBUG] [TestEventLogger] test.agent.server.TestScriptCapabilities > testAgentZooKeeper STARTED
12:44:30.141 [DEBUG] [TestEventLogger]
12:44:30.142 [DEBUG] [TestEventLogger] test.agent.server.TestScriptCapabilities > testAgentZooKeeper STANDARD_OUT
12:44:30.142 [DEBUG] [TestEventLogger]     2015/12/01 12:44:30.107 WARN [AgentMain] Detected ZooKeeper failure.
12:44:30.301 [QUIET] [system.out] 12:44:30.300 [INFO] [org.gradle.api.internal.tasks.testing.worker.TestWorker] Gradle Test Executor 5 finished executing tests.
12:44:30.308 [QUIET] [system.out] 12:44:30.308 [DEBUG] [org.gradle.process.internal.child.ActionExecutionWorker] Completed Gradle Test Executor 5.
12:44:30.356 [DEBUG] [TestEventLogger]
12:44:30.356 [DEBUG] [TestEventLogger] test.agent.server.TestScriptCapabilities > testAgentZooKeeper FAILED
12:44:30.358 [DEBUG] [TestEventLogger]     org.linkedin.glu.agent.api.ShellExecException: Error while executing command curl -k https://localhost:13906/mountPoint/s -E /Users/panand/Documents/dev/GitRepos/hub_glu/dev-keys/console.pem -X PUT -H Content-Type: text/json --data-binary @/private/var/folders/hc/q0rkrxcs4bngg233dy5pw9vw1kw32b/T/FileSystemImpl53029547/agent/server/home/data/tmp/__tmp1224371880 --output /private/var/folders/hc/q0rkrxcs4bngg233dy5pw9vw1kw32b/T/FileSystemImpl53029547/agent/server/home/data/tmp/__tmp230522849 --write-out %{http_code}: res=58 - output=000 - error=  % Total    % Received % Xferd  Average Speed   Time    Time     Time  Current
12:44:30.359 [DEBUG] [TestEventLogger]                                      Dload  Upload   Total   Spent    Left  Speed
12:44:30.359 [DEBUG] [TestEventLogger]
12:44:30.359 [DEBUG] [TestEventLogger]       0     0    0     0    0     0      0      0 --:--:-- --:--:-- --:--:--     0curl: (58) SSL: Can't load the certificate "/Users/panand/Documents/dev/GitRepos/hub_glu/dev-keys/console.pem" and its private key: OSStatus -25299
12:44:30.360 [DEBUG] [TestEventLogger]         at sun.reflect.NativeConstructorAccessorImpl.newInstance0(Native Method)
12:44:30.360 [DEBUG] [TestEventLogger]         at sun.reflect.NativeConstructorAccessorImpl.newInstance(NativeConstructorAccessorImpl.java:57)
12:44:30.360 [DEBUG] [TestEventLogger]         at sun.reflect.DelegatingConstructorAccessorImpl.newInstance(DelegatingConstructorAccessorImpl.java:45)
12:44:30.360 [DEBUG] [TestEventLogger]         at java.lang.reflect.Constructor.newInstance(Constructor.java:526)
12:44:30.360 [DEBUG] [TestEventLogger]         at org.codehaus.groovy.reflection.CachedConstructor.invoke(CachedConstructor.java:77)
12:44:30.361 [DEBUG] [TestEventLogger]         at org.codehaus.groovy.runtime.callsite.ConstructorSite$ConstructorSiteNoUnwrapNoCoerce.callConstructor(ConstructorSite.java:102)
12:44:30.361 [DEBUG] [TestEventLogger]         at org.codehaus.groovy.runtime.callsite.CallSiteArray.defaultCallConstructor(CallSiteArray.java:57)
12:44:30.359 [QUIET] [system.out] 12:44:30.359 [DEBUG] [org.gradle.process.internal.child.ActionExecutionWorker] Stopping client connection.
12:44:30.361 [DEBUG] [TestEventLogger]         at org.codehaus.groovy.runtime.callsite.AbstractCallSite.callConstructor(AbstractCallSite.java:232)
12:44:30.362 [DEBUG] [TestEventLogger]         at org.codehaus.groovy.runtime.callsite.AbstractCallSite.callConstructor(AbstractCallSite.java:244)
12:44:30.362 [DEBUG] [TestEventLogger]         at org.linkedin.glu.agent.impl.capabilities.ShellImpl.exec(ShellImpl.groovy:66)
12:44:30.362 [DEBUG] [TestEventLogger]         at org.linkedin.glu.agent.api.Shell$exec$2.call(Unknown Source)
12:44:30.362 [DEBUG] [TestEventLogger]         at org.codehaus.groovy.runtime.callsite.CallSiteArray.defaultCall(CallSiteArray.java:45)
12:44:30.363 [DEBUG] [TestEventLogger]         at org.codehaus.groovy.runtime.callsite.AbstractCallSite.call(AbstractCallSite.java:110)
12:44:30.363 [DEBUG] [TestEventLogger]         at org.codehaus.groovy.runtime.callsite.AbstractCallSite.call(AbstractCallSite.java:122)
12:44:30.363 [DEBUG] [TestEventLogger]         at test.agent.server.AgentForTest$_handleCurlCall_closure10.doCall(AgentForTest.groovy:313)
12:44:30.363 [DEBUG] [TestEventLogger]         at sun.reflect.NativeMethodAccessorImpl.invoke0(Native Method)
12:44:30.364 [DEBUG] [TestEventLogger]         at sun.reflect.NativeMethodAccessorImpl.invoke(NativeMethodAccessorImpl.java:57)
12:44:30.364 [DEBUG] [TestEventLogger]         at sun.reflect.DelegatingMethodAccessorImpl.invoke(DelegatingMethodAccessorImpl.java:43)
12:44:30.364 [DEBUG] [TestEventLogger]         at java.lang.reflect.Method.invoke(Method.java:606)
12:44:30.364 [DEBUG] [TestEventLogger]         at org.codehaus.groovy.reflection.CachedMethod.invoke(CachedMethod.java:90)
12:44:30.364 [DEBUG] [TestEventLogger]         at groovy.lang.MetaMethod.doMethodInvoke(MetaMethod.java:324)
12:44:30.365 [DEBUG] [TestEventLogger]         at org.codehaus.groovy.runtime.metaclass.ClosureMetaClass.invokeMethod(ClosureMetaClass.java:292)
12:44:30.365 [DEBUG] [TestEventLogger]         at groovy.lang.MetaClassImpl.invokeMethod(MetaClassImpl.java:1016)
12:44:30.365 [DEBUG] [TestEventLogger]         at org.codehaus.groovy.runtime.callsite.PogoMetaClassSite.call(PogoMetaClassSite.java:39)
12:44:30.365 [DEBUG] [TestEventLogger]         at org.codehaus.groovy.runtime.callsite.CallSiteArray.defaultCall(CallSiteArray.java:45)
12:44:30.365 [DEBUG] [TestEventLogger]         at org.codehaus.groovy.runtime.callsite.PogoMetaClassSite.call(PogoMetaClassSite.java:54)
12:44:30.366 [DEBUG] [TestEventLogger]         at org.codehaus.groovy.runtime.callsite.AbstractCallSite.call(AbstractCallSite.java:122)
12:44:30.366 [DEBUG] [TestEventLogger]         at org.linkedin.groovy.util.io.fs.FileSystemImpl.withTempFile(FileSystemImpl.groovy:262)
12:44:30.366 [DEBUG] [TestEventLogger]         at org.linkedin.groovy.util.io.fs.FileSystem$withTempFile$10.callCurrent(Unknown Source)
12:44:30.366 [DEBUG] [TestEventLogger]         at org.codehaus.groovy.runtime.callsite.CallSiteArray.defaultCallCurrent(CallSiteArray.java:49)
12:44:30.366 [DEBUG] [TestEventLogger]         at org.linkedin.groovy.util.io.fs.FileSystem$withTempFile$10.callCurrent(Unknown Source)
12:44:30.367 [DEBUG] [TestEventLogger]         at org.linkedin.groovy.util.io.fs.FileSystemImpl.withTempFile(FileSystemImpl.groovy:254)
12:44:30.367 [DEBUG] [TestEventLogger]         at org.linkedin.groovy.util.io.fs.FileSystem$withTempFile$9.call(Unknown Source)
12:44:30.367 [DEBUG] [TestEventLogger]         at org.codehaus.groovy.runtime.callsite.CallSiteArray.defaultCall(CallSiteArray.java:45)
12:44:30.367 [DEBUG] [TestEventLogger]         at org.linkedin.groovy.util.io.fs.FileSystem$withTempFile$9.call(Unknown Source)
12:44:30.367 [DEBUG] [TestEventLogger]         at org.linkedin.glu.groovy.utils.shell.ShellImpl.withTempFile(ShellImpl.groovy:106)
12:44:30.368 [DEBUG] [TestEventLogger]         at org.linkedin.groovy.util.io.fs.FileSystem$withTempFile$9.call(Unknown Source)
12:44:30.368 [DEBUG] [TestEventLogger]         at org.codehaus.groovy.runtime.callsite.CallSiteArray.defaultCall(CallSiteArray.java:45)
12:44:30.368 [DEBUG] [TestEventLogger]         at org.codehaus.groovy.runtime.callsite.AbstractCallSite.call(AbstractCallSite.java:110)
12:44:30.368 [DEBUG] [TestEventLogger]         at org.codehaus.groovy.runtime.callsite.AbstractCallSite.call(AbstractCallSite.java:122)
12:44:30.368 [DEBUG] [TestEventLogger]         at test.agent.server.AgentForTest.handleCurlCall(AgentForTest.groovy:308)
12:44:30.369 [DEBUG] [TestEventLogger]         at sun.reflect.NativeMethodAccessorImpl.invoke0(Native Method)
12:44:30.369 [DEBUG] [TestEventLogger]         at sun.reflect.NativeMethodAccessorImpl.invoke(NativeMethodAccessorImpl.java:57)
12:44:30.369 [DEBUG] [TestEventLogger]         at sun.reflect.DelegatingMethodAccessorImpl.invoke(DelegatingMethodAccessorImpl.java:43)
12:44:30.369 [DEBUG] [TestEventLogger]         at java.lang.reflect.Method.invoke(Method.java:606)
12:44:30.369 [DEBUG] [TestEventLogger]         at org.codehaus.groovy.reflection.CachedMethod.invoke(CachedMethod.java:90)
12:44:30.370 [DEBUG] [TestEventLogger]         at groovy.lang.MetaMethod.doMethodInvoke(MetaMethod.java:324)
12:44:30.370 [DEBUG] [TestEventLogger]         at org.codehaus.groovy.runtime.metaclass.ClosureMetaClass.invokeMethod(ClosureMetaClass.java:382)
12:44:30.370 [DEBUG] [TestEventLogger]         at groovy.lang.MetaClassImpl.invokeMethod(MetaClassImpl.java:1016)
12:44:30.370 [DEBUG] [TestEventLogger]         at org.codehaus.groovy.runtime.callsite.PogoMetaClassSite.callCurrent(PogoMetaClassSite.java:66)
12:44:30.371 [DEBUG] [TestEventLogger]         at org.codehaus.groovy.runtime.callsite.CallSiteArray.defaultCallCurrent(CallSiteArray.java:49)
12:44:30.371 [DEBUG] [TestEventLogger]         at org.codehaus.groovy.runtime.callsite.AbstractCallSite.callCurrent(AbstractCallSite.java:151)
12:44:30.371 [DEBUG] [TestEventLogger]         at org.codehaus.groovy.runtime.callsite.AbstractCallSite.callCurrent(AbstractCallSite.java:163)
12:44:30.371 [DEBUG] [TestEventLogger]         at test.agent.server.AgentForTest$_execRestPutCall_closure8.doCall(AgentForTest.groovy:281)
12:44:30.372 [DEBUG] [TestEventLogger]         at sun.reflect.NativeMethodAccessorImpl.invoke0(Native Method)
12:44:30.372 [DEBUG] [TestEventLogger]         at sun.reflect.NativeMethodAccessorImpl.invoke(NativeMethodAccessorImpl.java:57)
12:44:30.372 [DEBUG] [TestEventLogger]         at sun.reflect.DelegatingMethodAccessorImpl.invoke(DelegatingMethodAccessorImpl.java:43)
12:44:30.372 [DEBUG] [TestEventLogger]         at java.lang.reflect.Method.invoke(Method.java:606)
12:44:30.372 [DEBUG] [TestEventLogger]         at org.codehaus.groovy.reflection.CachedMethod.invoke(CachedMethod.java:90)
12:44:30.373 [DEBUG] [TestEventLogger]         at groovy.lang.MetaMethod.doMethodInvoke(MetaMethod.java:324)
12:44:30.373 [DEBUG] [TestEventLogger]         at org.codehaus.groovy.runtime.metaclass.ClosureMetaClass.invokeMethod(ClosureMetaClass.java:292)
12:44:30.373 [DEBUG] [TestEventLogger]         at groovy.lang.MetaClassImpl.invokeMethod(MetaClassImpl.java:1016)
12:44:30.374 [DEBUG] [TestEventLogger]         at org.codehaus.groovy.runtime.callsite.PogoMetaClassSite.call(PogoMetaClassSite.java:39)
12:44:30.374 [DEBUG] [TestEventLogger]         at org.codehaus.groovy.runtime.callsite.CallSiteArray.defaultCall(CallSiteArray.java:45)
12:44:30.374 [DEBUG] [TestEventLogger]         at org.codehaus.groovy.runtime.callsite.AbstractCallSite.call(AbstractCallSite.java:110)
12:44:30.374 [DEBUG] [TestEventLogger]         at org.codehaus.groovy.runtime.callsite.AbstractCallSite.call(AbstractCallSite.java:122)
12:44:30.375 [DEBUG] [TestEventLogger]         at org.linkedin.groovy.util.io.fs.FileSystemImpl.withTempFile(FileSystemImpl.groovy:262)
12:44:30.375 [DEBUG] [TestEventLogger]         at org.linkedin.groovy.util.io.fs.FileSystem$withTempFile$10.callCurrent(Unknown Source)
12:44:30.375 [DEBUG] [TestEventLogger]         at org.codehaus.groovy.runtime.callsite.CallSiteArray.defaultCallCurrent(CallSiteArray.java:49)
12:44:30.375 [DEBUG] [TestEventLogger]         at org.codehaus.groovy.runtime.callsite.AbstractCallSite.callCurrent(AbstractCallSite.java:151)
12:44:30.375 [DEBUG] [TestEventLogger]         at org.codehaus.groovy.runtime.callsite.AbstractCallSite.callCurrent(AbstractCallSite.java:171)
12:44:30.376 [DEBUG] [TestEventLogger]         at org.linkedin.groovy.util.io.fs.FileSystemImpl.withTempFile(FileSystemImpl.groovy:254)
12:44:30.376 [DEBUG] [TestEventLogger]         at org.linkedin.groovy.util.io.fs.FileSystem$withTempFile$9.call(Unknown Source)
12:44:30.376 [DEBUG] [TestEventLogger]         at org.codehaus.groovy.runtime.callsite.CallSiteArray.defaultCall(CallSiteArray.java:45)
12:44:30.376 [DEBUG] [TestEventLogger]         at org.codehaus.groovy.runtime.callsite.AbstractCallSite.call(AbstractCallSite.java:110)
12:44:30.376 [DEBUG] [TestEventLogger]         at org.codehaus.groovy.runtime.callsite.AbstractCallSite.call(AbstractCallSite.java:122)
12:44:30.377 [DEBUG] [TestEventLogger]         at org.linkedin.glu.groovy.utils.shell.ShellImpl.withTempFile(ShellImpl.groovy:106)
12:44:30.377 [DEBUG] [TestEventLogger]         at org.linkedin.groovy.util.io.fs.FileSystem$withTempFile$9.call(Unknown Source)
12:44:30.377 [DEBUG] [TestEventLogger]         at org.codehaus.groovy.runtime.callsite.CallSiteArray.defaultCall(CallSiteArray.java:45)
12:44:30.377 [DEBUG] [TestEventLogger]         at org.codehaus.groovy.runtime.callsite.AbstractCallSite.call(AbstractCallSite.java:110)
12:44:30.377 [DEBUG] [TestEventLogger]         at org.codehaus.groovy.runtime.callsite.AbstractCallSite.call(AbstractCallSite.java:122)
12:44:30.378 [DEBUG] [TestEventLogger]         at test.agent.server.AgentForTest.execRestPutCall(AgentForTest.groovy:271)
12:44:30.378 [DEBUG] [TestEventLogger]         at test.agent.server.AgentForTest$execRestPutCall$2.callCurrent(Unknown Source)
12:44:30.378 [DEBUG] [TestEventLogger]         at org.codehaus.groovy.runtime.callsite.CallSiteArray.defaultCallCurrent(CallSiteArray.java:49)
12:44:30.378 [DEBUG] [TestEventLogger]         at org.codehaus.groovy.runtime.callsite.AbstractCallSite.callCurrent(AbstractCallSite.java:151)
12:44:30.378 [DEBUG] [TestEventLogger]         at org.codehaus.groovy.runtime.callsite.AbstractCallSite.callCurrent(AbstractCallSite.java:171)
12:44:30.379 [DEBUG] [TestEventLogger]         at test.agent.server.AgentForTest.installScript(AgentForTest.groovy:195)
12:44:30.379 [DEBUG] [TestEventLogger]         at test.agent.server.AgentForTest$installScript$1.call(Unknown Source)
12:44:30.379 [DEBUG] [TestEventLogger]         at org.codehaus.groovy.runtime.callsite.CallSiteArray.defaultCall(CallSiteArray.java:45)
12:44:30.379 [DEBUG] [TestEventLogger]         at org.codehaus.groovy.runtime.callsite.AbstractCallSite.call(AbstractCallSite.java:110)
12:44:30.379 [DEBUG] [TestEventLogger]         at org.codehaus.groovy.runtime.callsite.AbstractCallSite.call(AbstractCallSite.java:122)
12:44:30.380 [DEBUG] [TestEventLogger]         at test.agent.server.TestScriptCapabilities.testAgentZooKeeper(TestScriptCapabilities.groovy:29)
12:44:30.380 [DEBUG] [TestEventLogger]         at sun.reflect.NativeMethodAccessorImpl.invoke0(Native Method)
12:44:30.380 [DEBUG] [TestEventLogger]         at sun.reflect.NativeMethodAccessorImpl.invoke(NativeMethodAccessorImpl.java:57)
12:44:30.380 [DEBUG] [TestEventLogger]         at sun.reflect.DelegatingMethodAccessorImpl.invoke(DelegatingMethodAccessorImpl.java:43)
12:44:30.380 [DEBUG] [TestEventLogger]         at java.lang.reflect.Method.invoke(Method.java:606)
12:44:30.381 [DEBUG] [TestEventLogger]         at junit.framework.TestCase.runTest(TestCase.java:176)
12:44:30.381 [DEBUG] [TestEventLogger]         at junit.framework.TestCase.runBare(TestCase.java:141)
12:44:30.381 [DEBUG] [TestEventLogger]         at junit.framework.TestResult$1.protect(TestResult.java:122)
12:44:30.381 [DEBUG] [TestEventLogger]         at junit.framework.TestResult.runProtected(TestResult.java:142)
12:44:30.382 [DEBUG] [TestEventLogger]         at junit.framework.TestResult.run(TestResult.java:125)
12:44:30.382 [DEBUG] [TestEventLogger]         at junit.framework.TestCase.run(TestCase.java:129)
12:44:30.382 [DEBUG] [TestEventLogger]         at junit.framework.TestSuite.runTest(TestSuite.java:252)
12:44:30.382 [DEBUG] [TestEventLogger]         at junit.framework.TestSuite.run(TestSuite.java:247)
12:44:30.383 [DEBUG] [TestEventLogger]         at org.junit.internal.runners.JUnit38ClassRunner.run(JUnit38ClassRunner.java:86)
12:44:30.383 [DEBUG] [TestEventLogger]         at org.gradle.api.internal.tasks.testing.junit.JUnitTestClassExecuter.runTestClass(JUnitTestClassExecuter.java:86)
12:44:30.383 [DEBUG] [TestEventLogger]         at org.gradle.api.internal.tasks.testing.junit.JUnitTestClassExecuter.execute(JUnitTestClassExecuter.java:49)
12:44:30.383 [DEBUG] [TestEventLogger]         at org.gradle.api.internal.tasks.testing.junit.JUnitTestClassProcessor.processTestClass(JUnitTestClassProcessor.java:64)
12:44:30.383 [DEBUG] [TestEventLogger]         at org.gradle.api.internal.tasks.testing.SuiteTestClassProcessor.processTestClass(SuiteTestClassProcessor.java:50)
12:44:30.384 [DEBUG] [TestEventLogger]         at sun.reflect.NativeMethodAccessorImpl.invoke0(Native Method)
12:44:30.384 [DEBUG] [TestEventLogger]         at sun.reflect.NativeMethodAccessorImpl.invoke(NativeMethodAccessorImpl.java:57)
12:44:30.384 [DEBUG] [TestEventLogger]         at sun.reflect.DelegatingMethodAccessorImpl.invoke(DelegatingMethodAccessorImpl.java:43)
12:44:30.384 [DEBUG] [TestEventLogger]         at java.lang.reflect.Method.invoke(Method.java:606)
12:44:30.384 [DEBUG] [TestEventLogger]         at org.gradle.messaging.dispatch.ReflectionDispatch.dispatch(ReflectionDispatch.java:35)
12:44:30.385 [DEBUG] [TestEventLogger]         at org.gradle.messaging.dispatch.ReflectionDispatch.dispatch(ReflectionDispatch.java:24)
12:44:30.385 [DEBUG] [TestEventLogger]         at org.gradle.messaging.dispatch.ContextClassLoaderDispatch.dispatch(ContextClassLoaderDispatch.java:32)
12:44:30.385 [DEBUG] [TestEventLogger]         at org.gradle.messaging.dispatch.ProxyDispatchAdapter$DispatchingInvocationHandler.invoke(ProxyDispatchAdapter.java:93)
12:44:30.385 [DEBUG] [TestEventLogger]         at com.sun.proxy.$Proxy2.processTestClass(Unknown Source)
12:44:30.386 [DEBUG] [TestEventLogger]         at org.gradle.api.internal.tasks.testing.worker.TestWorker.processTestClass(TestWorker.java:106)
12:44:30.386 [DEBUG] [TestEventLogger]         at sun.reflect.NativeMethodAccessorImpl.invoke0(Native Method)
12:44:30.386 [DEBUG] [TestEventLogger]         at sun.reflect.NativeMethodAccessorImpl.invoke(NativeMethodAccessorImpl.java:57)
12:44:30.386 [DEBUG] [TestEventLogger]         at sun.reflect.DelegatingMethodAccessorImpl.invoke(DelegatingMethodAccessorImpl.java:43)
12:44:30.387 [DEBUG] [TestEventLogger]         at java.lang.reflect.Method.invoke(Method.java:606)
12:44:30.387 [DEBUG] [TestEventLogger]         at org.gradle.messaging.dispatch.ReflectionDispatch.dispatch(ReflectionDispatch.java:35)
12:44:30.387 [DEBUG] [TestEventLogger]         at org.gradle.messaging.dispatch.ReflectionDispatch.dispatch(ReflectionDispatch.java:24)
12:44:30.387 [DEBUG] [TestEventLogger]         at org.gradle.messaging.remote.internal.hub.MessageHub$Handler.run(MessageHub.java:360)
12:44:30.387 [DEBUG] [TestEventLogger]         at org.gradle.internal.concurrent.DefaultExecutorFactory$StoppableExecutorImpl$1.run(DefaultExecutorFactory.java:64)
12:44:30.388 [DEBUG] [TestEventLogger]         at java.util.concurrent.ThreadPoolExecutor.runWorker(ThreadPoolExecutor.java:1145)
12:44:30.388 [DEBUG] [TestEventLogger]         at java.util.concurrent.ThreadPoolExecutor$Worker.run(ThreadPoolExecutor.java:615)
12:44:30.388 [DEBUG] [TestEventLogger]         at java.lang.Thread.run(Thread.java:744)
12:44:30.390 [DEBUG] [TestEventLogger]
12:44:30.390 [DEBUG] [TestEventLogger] test.agent.server.TestScriptCapabilities FAILED
12:44:30.390 [DEBUG] [TestEventLogger]
12:44:30.390 [DEBUG] [TestEventLogger] Gradle Test Executor 5 FAILED
12:44:32.728 [DEBUG] [org.gradle.process.internal.DefaultExecHandle] Changing state to: SUCCEEDED
12:44:32.728 [DEBUG] [org.gradle.process.internal.DefaultExecHandle] Process 'Gradle Test Executor 5' finished with exit value 0 (state: SUCCEEDED)
12:44:32.730 [DEBUG] [TestEventLogger]
12:44:32.731 [DEBUG] [TestEventLogger] Test Run FAILED
12:44:32.731 [ERROR] [org.gradle.api.internal.tasks.testing.logging.TestCountLogger]
9 tests completed, 3 failed
12:44:32.782 [INFO] [org.gradle.api.internal.tasks.testing.junit.result.Binary2JUnitXmlReportGenerator] Finished generating test XML results (0.033 secs) into: /Users/panand/Documents/dev/GitRepos/hub_glu/out/build/agent/org.linkedin.glu.agent-server-impl/test-results
12:44:32.783 [INFO] [org.gradle.api.internal.tasks.testing.junit.report.DefaultTestReport] Generating HTML test report...
12:44:32.867 [INFO] [org.gradle.api.internal.tasks.testing.junit.report.DefaultTestReport] Finished generating test html results (0.083 secs) into: /Users/panand/Documents/dev/GitRepos/hub_glu/out/build/agent/org.linkedin.glu.agent-server-impl/reports/tests
12:44:32.870 [DEBUG] [org.gradle.api.internal.tasks.execution.ExecuteAtMostOnceTaskExecuter] Finished executing task ':agent:org.linkedin.glu.agent-server-impl:test'
12:44:32.870 [LIFECYCLE] [class org.gradle.TaskExecutionLogger] :agent:org.linkedin.glu.agent-server-impl:test FAILED
12:44:32.871 [INFO] [org.gradle.execution.taskgraph.AbstractTaskPlanExecutor] :agent:org.linkedin.glu.agent-server-impl:test (Thread[main,5,main]) completed. Took 41.595 secs.
12:44:32.871 [DEBUG] [org.gradle.execution.taskgraph.AbstractTaskPlanExecutor] Task worker [Thread[main,5,main]] finished, busy: 48.843 secs, idle: 0.064 secs
12:44:32.880 [ERROR] [org.gradle.BuildExceptionReporter]
12:44:32.881 [ERROR] [org.gradle.BuildExceptionReporter] FAILURE: Build failed with an exception.
12:44:32.882 [ERROR] [org.gradle.BuildExceptionReporter]
12:44:32.882 [ERROR] [org.gradle.BuildExceptionReporter] * What went wrong:
12:44:32.883 [ERROR] [org.gradle.BuildExceptionReporter] Execution failed for task ':agent:org.linkedin.glu.agent-server-impl:test'.
12:44:32.883 [ERROR] [org.gradle.BuildExceptionReporter] > There were failing tests. See the report at: file:///Users/panand/Documents/dev/GitRepos/hub_glu/out/build/agent/org.linkedin.glu.agent-server-impl/reports/tests/index.html
12:44:32.885 [ERROR] [org.gradle.BuildExceptionReporter]
12:44:32.885 [ERROR] [org.gradle.BuildExceptionReporter] * Exception is:
12:44:32.887 [ERROR] [org.gradle.BuildExceptionReporter] org.gradle.api.tasks.TaskExecutionException: Execution failed for task ':agent:org.linkedin.glu.agent-server-impl:test'.
12:44:32.887 [ERROR] [org.gradle.BuildExceptionReporter] at org.gradle.api.internal.tasks.execution.ExecuteActionsTaskExecuter.executeActions(ExecuteActionsTaskExecuter.java:69)
12:44:32.888 [ERROR] [org.gradle.BuildExceptionReporter] at org.gradle.api.internal.tasks.execution.ExecuteActionsTaskExecuter.execute(ExecuteActionsTaskExecuter.java:46)
12:44:32.888 [ERROR] [org.gradle.BuildExceptionReporter] at org.gradle.api.internal.tasks.execution.PostExecutionAnalysisTaskExecuter.execute(PostExecutionAnalysisTaskExecuter.java:35)
12:44:32.889 [ERROR] [org.gradle.BuildExceptionReporter] at org.gradle.api.internal.tasks.execution.SkipUpToDateTaskExecuter.execute(SkipUpToDateTaskExecuter.java:64)
12:44:32.890 [ERROR] [org.gradle.BuildExceptionReporter] at org.gradle.api.internal.tasks.execution.ValidatingTaskExecuter.execute(ValidatingTaskExecuter.java:58)
12:44:32.890 [ERROR] [org.gradle.BuildExceptionReporter] at org.gradle.api.internal.tasks.execution.SkipEmptySourceFilesTaskExecuter.execute(SkipEmptySourceFilesTaskExecuter.java:42)
12:44:32.891 [ERROR] [org.gradle.BuildExceptionReporter] at org.gradle.api.internal.tasks.execution.SkipTaskWithNoActionsExecuter.execute(SkipTaskWithNoActionsExecuter.java:52)
12:44:32.891 [ERROR] [org.gradle.BuildExceptionReporter] at org.gradle.api.internal.tasks.execution.SkipOnlyIfTaskExecuter.execute(SkipOnlyIfTaskExecuter.java:53)
12:44:32.892 [ERROR] [org.gradle.BuildExceptionReporter] at org.gradle.api.internal.tasks.execution.ExecuteAtMostOnceTaskExecuter.execute(ExecuteAtMostOnceTaskExecuter.java:43)
12:44:32.892 [ERROR] [org.gradle.BuildExceptionReporter] at org.gradle.api.internal.AbstractTask.executeWithoutThrowingTaskFailure(AbstractTask.java:306)
12:44:32.892 [ERROR] [org.gradle.BuildExceptionReporter] at org.gradle.execution.taskgraph.AbstractTaskPlanExecutor$TaskExecutorWorker.executeTask(AbstractTaskPlanExecutor.java:79)
12:44:32.893 [ERROR] [org.gradle.BuildExceptionReporter] at org.gradle.execution.taskgraph.AbstractTaskPlanExecutor$TaskExecutorWorker.processTask(AbstractTaskPlanExecutor.java:63)
12:44:32.893 [ERROR] [org.gradle.BuildExceptionReporter] at org.gradle.execution.taskgraph.AbstractTaskPlanExecutor$TaskExecutorWorker.run(AbstractTaskPlanExecutor.java:51)
12:44:32.894 [ERROR] [org.gradle.BuildExceptionReporter] at org.gradle.execution.taskgraph.DefaultTaskPlanExecutor.process(DefaultTaskPlanExecutor.java:23)
12:44:32.894 [ERROR] [org.gradle.BuildExceptionReporter] at org.gradle.execution.taskgraph.DefaultTaskGraphExecuter.execute(DefaultTaskGraphExecuter.java:88)
12:44:32.894 [ERROR] [org.gradle.BuildExceptionReporter] at org.gradle.execution.SelectedTaskExecutionAction.execute(SelectedTaskExecutionAction.java:29)
12:44:32.895 [ERROR] [org.gradle.BuildExceptionReporter] at org.gradle.execution.DefaultBuildExecuter.execute(DefaultBuildExecuter.java:62)
12:44:32.895 [ERROR] [org.gradle.BuildExceptionReporter] at org.gradle.execution.DefaultBuildExecuter.access$200(DefaultBuildExecuter.java:23)
12:44:32.895 [ERROR] [org.gradle.BuildExceptionReporter] at org.gradle.execution.DefaultBuildExecuter$2.proceed(DefaultBuildExecuter.java:68)
12:44:32.896 [ERROR] [org.gradle.BuildExceptionReporter] at org.gradle.execution.DryRunBuildExecutionAction.execute(DryRunBuildExecutionAction.java:32)
12:44:32.896 [ERROR] [org.gradle.BuildExceptionReporter] at org.gradle.execution.DefaultBuildExecuter.execute(DefaultBuildExecuter.java:62)
12:44:32.896 [ERROR] [org.gradle.BuildExceptionReporter] at org.gradle.execution.DefaultBuildExecuter.execute(DefaultBuildExecuter.java:55)
12:44:32.897 [ERROR] [org.gradle.BuildExceptionReporter] at org.gradle.initialization.DefaultGradleLauncher.doBuildStages(DefaultGradleLauncher.java:149)
12:44:32.897 [ERROR] [org.gradle.BuildExceptionReporter] at org.gradle.initialization.DefaultGradleLauncher.doBuild(DefaultGradleLauncher.java:106)
12:44:32.898 [ERROR] [org.gradle.BuildExceptionReporter] at org.gradle.initialization.DefaultGradleLauncher.run(DefaultGradleLauncher.java:86)
12:44:32.898 [ERROR] [org.gradle.BuildExceptionReporter] at org.gradle.launcher.exec.InProcessBuildActionExecuter$DefaultBuildController.run(InProcessBuildActionExecuter.java:80)
12:44:32.898 [ERROR] [org.gradle.BuildExceptionReporter] at org.gradle.launcher.cli.ExecuteBuildAction.run(ExecuteBuildAction.java:33)
12:44:32.899 [ERROR] [org.gradle.BuildExceptionReporter] at org.gradle.launcher.cli.ExecuteBuildAction.run(ExecuteBuildAction.java:24)
12:44:32.899 [ERROR] [org.gradle.BuildExceptionReporter] at org.gradle.launcher.exec.InProcessBuildActionExecuter.execute(InProcessBuildActionExecuter.java:36)
12:44:32.900 [ERROR] [org.gradle.BuildExceptionReporter] at org.gradle.launcher.exec.InProcessBuildActionExecuter.execute(InProcessBuildActionExecuter.java:26)
12:44:32.900 [ERROR] [org.gradle.BuildExceptionReporter] at org.gradle.launcher.cli.RunBuildAction.run(RunBuildAction.java:51)
12:44:32.900 [ERROR] [org.gradle.BuildExceptionReporter] at org.gradle.internal.Actions$RunnableActionAdapter.execute(Actions.java:169)
12:44:32.900 [ERROR] [org.gradle.BuildExceptionReporter] at org.gradle.launcher.cli.CommandLineActionFactory$ParseAndBuildAction.execute(CommandLineActionFactory.java:237)
12:44:32.900 [ERROR] [org.gradle.BuildExceptionReporter] at org.gradle.launcher.cli.CommandLineActionFactory$ParseAndBuildAction.execute(CommandLineActionFactory.java:210)
12:44:32.901 [ERROR] [org.gradle.BuildExceptionReporter] at org.gradle.launcher.cli.JavaRuntimeValidationAction.execute(JavaRuntimeValidationAction.java:35)
12:44:32.901 [ERROR] [org.gradle.BuildExceptionReporter] at org.gradle.launcher.cli.JavaRuntimeValidationAction.execute(JavaRuntimeValidationAction.java:24)
12:44:32.901 [ERROR] [org.gradle.BuildExceptionReporter] at org.gradle.launcher.cli.CommandLineActionFactory$WithLogging.execute(CommandLineActionFactory.java:206)
12:44:32.901 [ERROR] [org.gradle.BuildExceptionReporter] at org.gradle.launcher.cli.CommandLineActionFactory$WithLogging.execute(CommandLineActionFactory.java:169)
12:44:32.901 [ERROR] [org.gradle.BuildExceptionReporter] at org.gradle.launcher.cli.ExceptionReportingAction.execute(ExceptionReportingAction.java:33)
12:44:32.902 [ERROR] [org.gradle.BuildExceptionReporter] at org.gradle.launcher.cli.ExceptionReportingAction.execute(ExceptionReportingAction.java:22)
12:44:32.912 [ERROR] [org.gradle.BuildExceptionReporter] at org.gradle.launcher.Main.doAction(Main.java:33)
12:44:32.912 [ERROR] [org.gradle.BuildExceptionReporter] at org.gradle.launcher.bootstrap.EntryPoint.run(EntryPoint.java:45)
12:44:32.912 [ERROR] [org.gradle.BuildExceptionReporter] at org.gradle.launcher.bootstrap.ProcessBootstrap.runNoExit(ProcessBootstrap.java:54)
12:44:32.913 [ERROR] [org.gradle.BuildExceptionReporter] at org.gradle.launcher.bootstrap.ProcessBootstrap.run(ProcessBootstrap.java:35)
12:44:32.913 [ERROR] [org.gradle.BuildExceptionReporter] at org.gradle.launcher.GradleMain.main(GradleMain.java:23)
12:44:32.913 [ERROR] [org.gradle.BuildExceptionReporter] at org.gradle.wrapper.BootstrapMainStarter.start(BootstrapMainStarter.java:30)
12:44:32.913 [ERROR] [org.gradle.BuildExceptionReporter] at org.gradle.wrapper.WrapperExecutor.execute(WrapperExecutor.java:127)
12:44:32.913 [ERROR] [org.gradle.BuildExceptionReporter] at org.gradle.wrapper.GradleWrapperMain.main(GradleWrapperMain.java:61)
12:44:32.914 [ERROR] [org.gradle.BuildExceptionReporter] Caused by: org.gradle.api.GradleException: There were failing tests. See the report at: file:///Users/panand/Documents/dev/GitRepos/hub_glu/out/build/agent/org.linkedin.glu.agent-server-impl/reports/tests/index.html
12:44:32.914 [ERROR] [org.gradle.BuildExceptionReporter] at org.gradle.api.tasks.testing.Test.handleTestFailures(Test.java:1118)
12:44:32.914 [ERROR] [org.gradle.BuildExceptionReporter] at org.gradle.api.tasks.testing.Test.executeTests(Test.java:549)
12:44:32.914 [ERROR] [org.gradle.BuildExceptionReporter] at org.gradle.internal.reflect.JavaMethod.invoke(JavaMethod.java:63)
12:44:32.914 [ERROR] [org.gradle.BuildExceptionReporter] at org.gradle.api.internal.project.taskfactory.AnnotationProcessingTaskFactory$StandardTaskAction.doExecute(AnnotationProcessingTaskFactory.java:218)
12:44:32.915 [ERROR] [org.gradle.BuildExceptionReporter] at org.gradle.api.internal.project.taskfactory.AnnotationProcessingTaskFactory$StandardTaskAction.execute(AnnotationProcessingTaskFactory.java:211)
12:44:32.915 [ERROR] [org.gradle.BuildExceptionReporter] at org.gradle.api.internal.project.taskfactory.AnnotationProcessingTaskFactory$StandardTaskAction.execute(AnnotationProcessingTaskFactory.java:200)
12:44:32.915 [ERROR] [org.gradle.BuildExceptionReporter] at org.gradle.api.internal.AbstractTask$TaskActionWrapper.execute(AbstractTask.java:585)
12:44:32.915 [ERROR] [org.gradle.BuildExceptionReporter] at org.gradle.api.internal.AbstractTask$TaskActionWrapper.execute(AbstractTask.java:568)
12:44:32.915 [ERROR] [org.gradle.BuildExceptionReporter] at org.gradle.api.internal.tasks.execution.ExecuteActionsTaskExecuter.executeAction(ExecuteActionsTaskExecuter.java:80)
12:44:32.916 [ERROR] [org.gradle.BuildExceptionReporter] at org.gradle.api.internal.tasks.execution.ExecuteActionsTaskExecuter.executeActions(ExecuteActionsTaskExecuter.java:61)
12:44:32.916 [ERROR] [org.gradle.BuildExceptionReporter] ... 47 more
12:44:32.916 [ERROR] [org.gradle.BuildExceptionReporter]
12:44:32.916 [LIFECYCLE] [org.gradle.BuildResultLogger]
12:44:32.917 [LIFECYCLE] [org.gradle.BuildResultLogger] BUILD FAILED
12:44:32.917 [LIFECYCLE] [org.gradle.BuildResultLogger]
12:44:32.918 [LIFECYCLE] [org.gradle.BuildResultLogger] Total time: 1 mins 4.286 secs
12:44:32.967 [INFO] [org.gradle.api.Project] {
    "name": "hub_glu",
    "version": "5.6.1-SNAPSHOT",
    "scmUrl": "git@github.com:pongasoft/glu.git",
    "scmCommitVersion": "33c77fc4d97b3f39d7443638509624a8f0de4de6",
    "gradleVersion": "2.3",
    "jvm": "1.7.0_51 (Oracle Corporation 24.51-b03)",
    "os": "Mac OS X 10.10.5 x86_64",
    "buildTime": 1448954008631,
    "buildTimeString": "2015/12/01 12:43:28 IST",
    "buildDuration": 64288,
    "buildDurationString": "1 mins 4.288 secs",
    "buildTasks": [
        "test"
    ]
}
Reply | Threaded
Open this post in threaded view
|  
Report Content as Inappropriate

Re: Unable to compile glu - testAgentZooKeeper FAILED

frenchyan
Administrator
Not entirely sure what is going but it is seems to be due to this:

12:44:30.359 [DEBUG] [TestEventLogger]       0     0    0     0    0     0      0      0 --:--:-- --:--:-- --:--:--     0curl: (58) SSL: Can't load the certificate "/Users/panand/Documents/dev/GitRepos/hub_glu/dev-keys/console.pem" and its private key: OSStatus -25299 

I have never seen this error before. Anybody has any idea?

Yan
Loading...